您尚未登录。

#1 2021-10-20 00:26:42

chen05_20
会员
注册时间: 2021-04-02
帖子: 68

npm安装node-sass报错

想跑一个前端项目,报错内容略多,package.json去掉node-sass就没报错,感觉是编译的问题,有小伙伴知道怎么解决么?

1506 verbose pkgid node-sass@4.14.1
1507 verbose cwd /it/www/vue
1508 verbose Linux 5.14.12-arch1-1
1509 verbose argv "/usr/bin/node" "/usr/bin/npm" "install"
1510 verbose node v16.11.1
1511 verbose npm  v8.1.0
1512 error code 1
1513 error path /it/www/vue/node_modules/node-sass
1514 error command failed
1515 error command sh -c node scripts/build.js
1516 error Building: /usr/bin/node /it/www/vue/node_modules/node-gyp/bin/node-gyp.js rebuild --verbose --libsass_ext= --libsass_cflags= --libsass_ldflags= --libsass_library=
1516 error make: 进入目录“/it/www/vue/node_modules/node-sass/build”
1516 error   g++ '-DNODE_GYP_MODULE_NAME=libsass' '-DUSING_UV_SHARED=1' '-DUSING_V8_SHARED=1' '-DV8_DEPRECATION_WARNINGS=1' '-DV8_DEPRECATION_WARNINGS' '-DV8_IMMINENT_DEPRECATION_WARNINGS' '-D_GLIBCXX_USE_CXX11_ABI=1' '-D_LARGEFILE_SOURCE' '-D_FILE_OFFSET_BITS=64' '-D__STDC_FORMAT_MACROS' '-DLIBSASS_VERSION="3.5.5"' -I/home/cm/.node-gyp/16.11.1/include/node -I/home/cm/.node-gyp/16.11.1/src -I/home/cm/.node-gyp/16.11.1/deps/openssl/config -I/home/cm/.node-gyp/16.11.1/deps/openssl/openssl/include -I/home/cm/.node-gyp/16.11.1/deps/uv/include -I/home/cm/.node-gyp/16.11.1/deps/zlib -I/home/cm/.node-gyp/16.11.1/deps/v8/include -I../src/libsass/include  -fPIC -pthread -Wall -Wextra -Wno-unused-parameter -m64 -O3 -fno-omit-frame-pointer -std=gnu++14 -std=c++0x -fexceptions -frtti -MMD -MF ./Release/.deps/Release/obj.target/libsass/src/libsass/src/ast.o.d.raw   -c -o Release/obj.target/libsass/src/libsass/src/ast.o ../src/libsass/src/ast.cpp
1516 error   g++ '-DNODE_GYP_MODULE_NAME=libsass' '-DUSING_UV_SHARED=1' '-DUSING_V8_SHARED=1' '-DV8_DEPRECATION_WARNINGS=1' '-DV8_DEPRECATION_WARNINGS' '-DV8_IMMINENT_DEPRECATION_WARNINGS' '-D_GLIBCXX_USE_CXX11_ABI=1' '-D_LARGEFILE_SOURCE' '-D_FILE_OFFSET_BITS=64' '-D__STDC_FORMAT_MACROS' '-DLIBSASS_VERSION="3.5.5"' -I/home/cm/.node-gyp/16.11.1/include/node -I/home/cm/.node-gyp/16.11.1/src -I/home/cm/.node-gyp/16.11.1/deps/openssl/config -I/home/cm/.node-gyp/16.11.1/deps/openssl/openssl/include -I/home/cm/.node-gyp/16.11.1/deps/uv/include -I/home/cm/.node-gyp/16.11.1/deps/zlib -I/home/cm/.node-gyp/16.11.1/deps/v8/include -I../src/libsass/include  -fPIC -pthread -Wall -Wextra -Wno-unused-parameter -m64 -O3 -fno-omit-frame-pointer -std=gnu++14 -std=c++0x -fexceptions -frtti -MMD -MF ./Release/.deps/Release/obj.target/libsass/src/libsass/src/ast_fwd_decl.o.d.raw   -c -o Release/obj.target/libsass/src/libsass/src/ast_fwd_decl.o ../src/libsass/src/ast_fwd_decl.cpp
1516 error   g++ '-DNODE_GYP_MODULE_NAME=libsass' '-DUSING_UV_SHARED=1' '-DUSING_V8_SHARED=1' '-DV8_DEPRECATION_WARNINGS=1' '-DV8_DEPRECATION_WARNINGS' '-DV8_IMMINENT_DEPRECATION_WARNINGS' '-D_GLIBCXX_USE_CXX11_ABI=1' '-D_LARGEFILE_SOURCE' '-D_FILE_OFFSET_BITS=64' '-D__STDC_FORMAT_MACROS' '-DLIBSASS_VERSION="3.5.5"' -I/home/cm/.node-gyp/16.11.1/include/node -I/home/cm/.node-gyp/16.11.1/src -I/home/cm/.node-gyp/16.11.1/deps/openssl/config -I/home/cm/.node-gyp/16.11.1/deps/openssl/openssl/include -I/home/cm/.node-gyp/16.11.1/deps/uv/include -I/home/cm/.node-gyp/16.11.1/deps/zlib -I/home/cm/.node-gyp/16.11.1/deps/v8/include -I../src/libsass/include  -fPIC -pthread -Wall -Wextra -Wno-unused-parameter -m64 -O3 -fno-omit-frame-pointer -std=gnu++14 -std=c++0x -fexceptions -frtti -MMD -MF ./Release/.deps/Release/obj.target/libsass/src/libsass/src/backtrace.o.d.raw   -c -o Release/obj.target/libsass/src/libsass/src/backtrace.o ../src/libsass/src/backtrace.cpp
1516 error   g++ '-DNODE_GYP_MODULE_NAME=libsass' '-DUSING_UV_SHARED=1' '-DUSING_V8_SHARED=1' '-DV8_DEPRECATION_WARNINGS=1' '-DV8_DEPRECATION_WARNINGS' '-DV8_IMMINENT_DEPRECATION_WARNINGS' '-D_GLIBCXX_USE_CXX11_ABI=1' '-D_LARGEFILE_SOURCE' '-D_FILE_OFFSET_BITS=64' '-D__STDC_FORMAT_MACROS' '-DLIBSASS_VERSION="3.5.5"' -I/home/cm/.node-gyp/16.11.1/include/node -I/home/cm/.node-gyp/16.11.1/src -I/home/cm/.node-gyp/16.11.1/deps/openssl/config -I/home/cm/.node-gyp/16.11.1/deps/openssl/openssl/include -I/home/cm/.node-gyp/16.11.1/deps/uv/include -I/home/cm/.node-gyp/16.11.1/deps/zlib -I/home/cm/.node-gyp/16.11.1/deps/v8/include -I../src/libsass/include  -fPIC -pthread -Wall -Wextra -Wno-unused-parameter -m64 -O3 -fno-omit-frame-pointer -std=gnu++14 -std=c++0x -fexceptions -frtti -MMD -MF ./Release/.deps/Release/obj.target/libsass/src/libsass/src/base64vlq.o.d.raw   -c -o Release/obj.target/libsass/src/libsass/src/base64vlq.o ../src/libsass/src/base64vlq.cpp
1516 error   g++ '-DNODE_GYP_MODULE_NAME=libsass' '-DUSING_UV_SHARED=1' '-DUSING_V8_SHARED=1' '-DV8_DEPRECATION_WARNINGS=1' '-DV8_DEPRECATION_WARNINGS' '-DV8_IMMINENT_DEPRECATION_WARNINGS' '-D_GLIBCXX_USE_CXX11_ABI=1' '-D_LARGEFILE_SOURCE' '-D_FILE_OFFSET_BITS=64' '-D__STDC_FORMAT_MACROS' '-DLIBSASS_VERSION="3.5.5"' -I/home/cm/.node-gyp/16.11.1/include/node -I/home/cm/.node-gyp/16.11.1/src -I/home/cm/.node-gyp/16.11.1/deps/openssl/config -I/home/cm/.node-gyp/16.11.1/deps/openssl/openssl/include -I/home/cm/.node-gyp/16.11.1/deps/uv/include -I/home/cm/.node-gyp/16.11.1/deps/zlib -I/home/cm/.node-gyp/16.11.1/deps/v8/include -I../src/libsass/include  -fPIC -pthread -Wall -Wextra -Wno-unused-parameter -m64 -O3 -fno-omit-frame-pointer -std=gnu++14 -std=c++0x -fexceptions -frtti -MMD -MF ./Release/.deps/Release/obj.target/libsass/src/libsass/src/bind.o.d.raw   -c -o Release/obj.target/libsass/src/libsass/src/bind.o ../src/libsass/src/bind.cpp
1516 error   cc '-DNODE_GYP_MODULE_NAME=libsass' '-DUSING_UV_SHARED=1' '-DUSING_V8_SHARED=1' '-DV8_DEPRECATION_WARNINGS=1' '-DV8_DEPRECATION_WARNINGS' '-DV8_IMMINENT_DEPRECATION_WARNINGS' '-D_GLIBCXX_USE_CXX11_ABI=1' '-D_LARGEFILE_SOURCE' '-D_FILE_OFFSET_BITS=64' '-D__STDC_FORMAT_MACROS' '-DLIBSASS_VERSION="3.5.5"' -I/home/cm/.node-gyp/16.11.1/include/node -I/home/cm/.node-gyp/16.11.1/src -I/home/cm/.node-gyp/16.11.1/deps/openssl/config -I/home/cm/.node-gyp/16.11.1/deps/openssl/openssl/include -I/home/cm/.node-gyp/16.11.1/deps/uv/include -I/home/cm/.node-gyp/16.11.1/deps/zlib -I/home/cm/.node-gyp/16.11.1/deps/v8/include -I../src/libsass/include  -fPIC -pthread -Wall -Wextra -Wno-unused-parameter -m64 -O3 -fno-omit-frame-pointer  -MMD -MF ./Release/.deps/Release/obj.target/libsass/src/libsass/src/cencode.o.d.raw   -c -o Release/obj.target/libsass/src/libsass/src/cencode.o ../src/libsass/src/cencode.c
1516 error   g++ '-DNODE_GYP_MODULE_NAME=libsass' '-DUSING_UV_SHARED=1' '-DUSING_V8_SHARED=1' '-DV8_DEPRECATION_WARNINGS=1' '-DV8_DEPRECATION_WARNINGS' '-DV8_IMMINENT_DEPRECATION_WARNINGS' '-D_GLIBCXX_USE_CXX11_ABI=1' '-D_LARGEFILE_SOURCE' '-D_FILE_OFFSET_BITS=64' '-D__STDC_FORMAT_MACROS' '-DLIBSASS_VERSION="3.5.5"' -I/home/cm/.node-gyp/16.11.1/include/node -I/home/cm/.node-gyp/16.11.1/src -I/home/cm/.node-gyp/16.11.1/deps/openssl/config -I/home/cm/.node-gyp/16.11.1/deps/openssl/openssl/include -I/home/cm/.node-gyp/16.11.1/deps/uv/include -I/home/cm/.node-gyp/16.11.1/deps/zlib -I/home/cm/.node-gyp/16.11.1/deps/v8/include -I../src/libsass/include  -fPIC -pthread -Wall -Wextra -Wno-unused-parameter -m64 -O3 -fno-omit-frame-pointer -std=gnu++14 -std=c++0x -fexceptions -frtti -MMD -MF ./Release/.deps/Release/obj.target/libsass/src/libsass/src/check_nesting.o.d.raw   -c -o Release/obj.target/libsass/src/libsass/src/check_nesting.o ../src/libsass/src/check_nesting.cpp
1516 error   g++ '-DNODE_GYP_MODULE_NAME=libsass' '-DUSING_UV_SHARED=1' '-DUSING_V8_SHARED=1' '-DV8_DEPRECATION_WARNINGS=1' '-DV8_DEPRECATION_WARNINGS' '-DV8_IMMINENT_DEPRECATION_WARNINGS' '-D_GLIBCXX_USE_CXX11_ABI=1' '-D_LARGEFILE_SOURCE' '-D_FILE_OFFSET_BITS=64' '-D__STDC_FORMAT_MACROS' '-DLIBSASS_VERSION="3.5.5"' -I/home/cm/.node-gyp/16.11.1/include/node -I/home/cm/.node-gyp/16.11.1/src -I/home/cm/.node-gyp/16.11.1/deps/openssl/config -I/home/cm/.node-gyp/16.11.1/deps/openssl/openssl/include -I/home/cm/.node-gyp/16.11.1/deps/uv/include -I/home/cm/.node-gyp/16.11.1/deps/zlib -I/home/cm/.node-gyp/16.11.1/deps/v8/include -I../src/libsass/include  -fPIC -pthread -Wall -Wextra -Wno-unused-parameter -m64 -O3 -fno-omit-frame-pointer -std=gnu++14 -std=c++0x -fexceptions -frtti -MMD -MF ./Release/.deps/Release/obj.target/libsass/src/libsass/src/color_maps.o.d.raw   -c -o Release/obj.target/libsass/src/libsass/src/color_maps.o ../src/libsass/src/color_maps.cpp
1516 error   g++ '-DNODE_GYP_MODULE_NAME=libsass' '-DUSING_UV_SHARED=1' '-DUSING_V8_SHARED=1' '-DV8_DEPRECATION_WARNINGS=1' '-DV8_DEPRECATION_WARNINGS' '-DV8_IMMINENT_DEPRECATION_WARNINGS' '-D_GLIBCXX_USE_CXX11_ABI=1' '-D_LARGEFILE_SOURCE' '-D_FILE_OFFSET_BITS=64' '-D__STDC_FORMAT_MACROS' '-DLIBSASS_VERSION="3.5.5"' -I/home/cm/.node-gyp/16.11.1/include/node -I/home/cm/.node-gyp/16.11.1/src -I/home/cm/.node-gyp/16.11.1/deps/openssl/config -I/home/cm/.node-gyp/16.11.1/deps/openssl/openssl/include -I/home/cm/.node-gyp/16.11.1/deps/uv/include -I/home/cm/.node-gyp/16.11.1/deps/zlib -I/home/cm/.node-gyp/16.11.1/deps/v8/include -I../src/libsass/include  -fPIC -pthread -Wall -Wextra -Wno-unused-parameter -m64 -O3 -fno-omit-frame-pointer -std=gnu++14 -std=c++0x -fexceptions -frtti -MMD -MF ./Release/.deps/Release/obj.target/libsass/src/libsass/src/constants.o.d.raw   -c -o Release/obj.target/libsass/src/libsass/src/constants.o ../src/libsass/src/constants.cpp
1516 error   g++ '-DNODE_GYP_MODULE_NAME=libsass' '-DUSING_UV_SHARED=1' '-DUSING_V8_SHARED=1' '-DV8_DEPRECATION_WARNINGS=1' '-DV8_DEPRECATION_WARNINGS' '-DV8_IMMINENT_DEPRECATION_WARNINGS' '-D_GLIBCXX_USE_CXX11_ABI=1' '-D_LARGEFILE_SOURCE' '-D_FILE_OFFSET_BITS=64' '-D__STDC_FORMAT_MACROS' '-DLIBSASS_VERSION="3.5.5"' -I/home/cm/.node-gyp/16.11.1/include/node -I/home/cm/.node-gyp/16.11.1/src -I/home/cm/.node-gyp/16.11.1/deps/openssl/config -I/home/cm/.node-gyp/16.11.1/deps/openssl/openssl/include -I/home/cm/.node-gyp/16.11.1/deps/uv/include -I/home/cm/.node-gyp/16.11.1/deps/zlib -I/home/cm/.node-gyp/16.11.1/deps/v8/include -I../src/libsass/include  -fPIC -pthread -Wall -Wextra -Wno-unused-parameter -m64 -O3 -fno-omit-frame-pointer -std=gnu++14 -std=c++0x -fexceptions -frtti -MMD -MF ./Release/.deps/Release/obj.target/libsass/src/libsass/src/context.o.d.raw   -c -o Release/obj.target/libsass/src/libsass/src/context.o ../src/libsass/src/context.cpp
1516 error   g++ '-DNODE_GYP_MODULE_NAME=libsass' '-DUSING_UV_SHARED=1' '-DUSING_V8_SHARED=1' '-DV8_DEPRECATION_WARNINGS=1' '-DV8_DEPRECATION_WARNINGS' '-DV8_IMMINENT_DEPRECATION_WARNINGS' '-D_GLIBCXX_USE_CXX11_ABI=1' '-D_LARGEFILE_SOURCE' '-D_FILE_OFFSET_BITS=64' '-D__STDC_FORMAT_MACROS' '-DLIBSASS_VERSION="3.5.5"' -I/home/cm/.node-gyp/16.11.1/include/node -I/home/cm/.node-gyp/16.11.1/src -I/home/cm/.node-gyp/16.11.1/deps/openssl/config -I/home/cm/.node-gyp/16.11.1/deps/openssl/openssl/include -I/home/cm/.node-gyp/16.11.1/deps/uv/include -I/home/cm/.node-gyp/16.11.1/deps/zlib -I/home/cm/.node-gyp/16.11.1/deps/v8/include -I../src/libsass/include  -fPIC -pthread -Wall -Wextra -Wno-unused-parameter -m64 -O3 -fno-omit-frame-pointer -std=gnu++14 -std=c++0x -fexceptions -frtti -MMD -MF ./Release/.deps/Release/obj.target/libsass/src/libsass/src/cssize.o.d.raw   -c -o Release/obj.target/libsass/src/libsass/src/cssize.o ../src/libsass/src/cssize.cpp
1516 error   g++ '-DNODE_GYP_MODULE_NAME=libsass' '-DUSING_UV_SHARED=1' '-DUSING_V8_SHARED=1' '-DV8_DEPRECATION_WARNINGS=1' '-DV8_DEPRECATION_WARNINGS' '-DV8_IMMINENT_DEPRECATION_WARNINGS' '-D_GLIBCXX_USE_CXX11_ABI=1' '-D_LARGEFILE_SOURCE' '-D_FILE_OFFSET_BITS=64' '-D__STDC_FORMAT_MACROS' '-DLIBSASS_VERSION="3.5.5"' -I/home/cm/.node-gyp/16.11.1/include/node -I/home/cm/.node-gyp/16.11.1/src -I/home/cm/.node-gyp/16.11.1/deps/openssl/config -I/home/cm/.node-gyp/16.11.1/deps/openssl/openssl/include -I/home/cm/.node-gyp/16.11.1/deps/uv/include -I/home/cm/.node-gyp/16.11.1/deps/zlib -I/home/cm/.node-gyp/16.11.1/deps/v8/include -I../src/libsass/include  -fPIC -pthread -Wall -Wextra -Wno-unused-parameter -m64 -O3 -fno-omit-frame-pointer -std=gnu++14 -std=c++0x -fexceptions -frtti -MMD -MF ./Release/.deps/Release/obj.target/libsass/src/libsass/src/emitter.o.d.raw   -c -o Release/obj.target/libsass/src/libsass/src/emitter.o ../src/libsass/src/emitter.cpp
1516 error   g++ '-DNODE_GYP_MODULE_NAME=libsass' '-DUSING_UV_SHARED=1' '-DUSING_V8_SHARED=1' '-DV8_DEPRECATION_WARNINGS=1' '-DV8_DEPRECATION_WARNINGS' '-DV8_IMMINENT_DEPRECATION_WARNINGS' '-D_GLIBCXX_USE_CXX11_ABI=1' '-D_LARGEFILE_SOURCE' '-D_FILE_OFFSET_BITS=64' '-D__STDC_FORMAT_MACROS' '-DLIBSASS_VERSION="3.5.5"' -I/home/cm/.node-gyp/16.11.1/include/node -I/home/cm/.node-gyp/16.11.1/src -I/home/cm/.node-gyp/16.11.1/deps/openssl/config -I/home/cm/.node-gyp/16.11.1/deps/openssl/openssl/include -I/home/cm/.node-gyp/16.11.1/deps/uv/include -I/home/cm/.node-gyp/16.11.1/deps/zlib -I/home/cm/.node-gyp/16.11.1/deps/v8/include -I../src/libsass/include  -fPIC -pthread -Wall -Wextra -Wno-unused-parameter -m64 -O3 -fno-omit-frame-pointer -std=gnu++14 -std=c++0x -fexceptions -frtti -MMD -MF ./Release/.deps/Release/obj.target/libsass/src/libsass/src/environment.o.d.raw   -c -o Release/obj.target/libsass/src/libsass/src/environment.o ../src/libsass/src/environment.cpp
1516 error   g++ '-DNODE_GYP_MODULE_NAME=libsass' '-DUSING_UV_SHARED=1' '-DUSING_V8_SHARED=1' '-DV8_DEPRECATION_WARNINGS=1' '-DV8_DEPRECATION_WARNINGS' '-DV8_IMMINENT_DEPRECATION_WARNINGS' '-D_GLIBCXX_USE_CXX11_ABI=1' '-D_LARGEFILE_SOURCE' '-D_FILE_OFFSET_BITS=64' '-D__STDC_FORMAT_MACROS' '-DLIBSASS_VERSION="3.5.5"' -I/home/cm/.node-gyp/16.11.1/include/node -I/home/cm/.node-gyp/16.11.1/src -I/home/cm/.node-gyp/16.11.1/deps/openssl/config -I/home/cm/.node-gyp/16.11.1/deps/openssl/openssl/include -I/home/cm/.node-gyp/16.11.1/deps/uv/include -I/home/cm/.node-gyp/16.11.1/deps/zlib -I/home/cm/.node-gyp/16.11.1/deps/v8/include -I../src/libsass/include  -fPIC -pthread -Wall -Wextra -Wno-unused-parameter -m64 -O3 -fno-omit-frame-pointer -std=gnu++14 -std=c++0x -fexceptions -frtti -MMD -MF ./Release/.deps/Release/obj.target/libsass/src/libsass/src/error_handling.o.d.raw   -c -o Release/obj.target/libsass/src/libsass/src/error_handling.o ../src/libsass/src/error_handling.cpp
1516 error   g++ '-DNODE_GYP_MODULE_NAME=libsass' '-DUSING_UV_SHARED=1' '-DUSING_V8_SHARED=1' '-DV8_DEPRECATION_WARNINGS=1' '-DV8_DEPRECATION_WARNINGS' '-DV8_IMMINENT_DEPRECATION_WARNINGS' '-D_GLIBCXX_USE_CXX11_ABI=1' '-D_LARGEFILE_SOURCE' '-D_FILE_OFFSET_BITS=64' '-D__STDC_FORMAT_MACROS' '-DLIBSASS_VERSION="3.5.5"' -I/home/cm/.node-gyp/16.11.1/include/node -I/home/cm/.node-gyp/16.11.1/src -I/home/cm/.node-gyp/16.11.1/deps/openssl/config -I/home/cm/.node-gyp/16.11.1/deps/openssl/openssl/include -I/home/cm/.node-gyp/16.11.1/deps/uv/include -I/home/cm/.node-gyp/16.11.1/deps/zlib -I/home/cm/.node-gyp/16.11.1/deps/v8/include -I../src/libsass/include  -fPIC -pthread -Wall -Wextra -Wno-unused-parameter -m64 -O3 -fno-omit-frame-pointer -std=gnu++14 -std=c++0x -fexceptions -frtti -MMD -MF ./Release/.deps/Release/obj.target/libsass/src/libsass/src/eval.o.d.raw   -c -o Release/obj.target/libsass/src/libsass/src/eval.o ../src/libsass/src/eval.cpp
1516 error   g++ '-DNODE_GYP_MODULE_NAME=libsass' '-DUSING_UV_SHARED=1' '-DUSING_V8_SHARED=1' '-DV8_DEPRECATION_WARNINGS=1' '-DV8_DEPRECATION_WARNINGS' '-DV8_IMMINENT_DEPRECATION_WARNINGS' '-D_GLIBCXX_USE_CXX11_ABI=1' '-D_LARGEFILE_SOURCE' '-D_FILE_OFFSET_BITS=64' '-D__STDC_FORMAT_MACROS' '-DLIBSASS_VERSION="3.5.5"' -I/home/cm/.node-gyp/16.11.1/include/node -I/home/cm/.node-gyp/16.11.1/src -I/home/cm/.node-gyp/16.11.1/deps/openssl/config -I/home/cm/.node-gyp/16.11.1/deps/openssl/openssl/include -I/home/cm/.node-gyp/16.11.1/deps/uv/include -I/home/cm/.node-gyp/16.11.1/deps/zlib -I/home/cm/.node-gyp/16.11.1/deps/v8/include -I../src/libsass/include  -fPIC -pthread -Wall -Wextra -Wno-unused-parameter -m64 -O3 -fno-omit-frame-pointer -std=gnu++14 -std=c++0x -fexceptions -frtti -MMD -MF ./Release/.deps/Release/obj.target/libsass/src/libsass/src/expand.o.d.raw   -c -o Release/obj.target/libsass/src/libsass/src/expand.o ../src/libsass/src/expand.cpp
1516 error   g++ '-DNODE_GYP_MODULE_NAME=libsass' '-DUSING_UV_SHARED=1' '-DUSING_V8_SHARED=1' '-DV8_DEPRECATION_WARNINGS=1' '-DV8_DEPRECATION_WARNINGS' '-DV8_IMMINENT_DEPRECATION_WARNINGS' '-D_GLIBCXX_USE_CXX11_ABI=1' '-D_LARGEFILE_SOURCE' '-D_FILE_OFFSET_BITS=64' '-D__STDC_FORMAT_MACROS' '-DLIBSASS_VERSION="3.5.5"' -I/home/cm/.node-gyp/16.11.1/include/node -I/home/cm/.node-gyp/16.11.1/src -I/home/cm/.node-gyp/16.11.1/deps/openssl/config -I/home/cm/.node-gyp/16.11.1/deps/openssl/openssl/include -I/home/cm/.node-gyp/16.11.1/deps/uv/include -I/home/cm/.node-gyp/16.11.1/deps/zlib -I/home/cm/.node-gyp/16.11.1/deps/v8/include -I../src/libsass/include  -fPIC -pthread -Wall -Wextra -Wno-unused-parameter -m64 -O3 -fno-omit-frame-pointer -std=gnu++14 -std=c++0x -fexceptions -frtti -MMD -MF ./Release/.deps/Release/obj.target/libsass/src/libsass/src/extend.o.d.raw   -c -o Release/obj.target/libsass/src/libsass/src/extend.o ../src/libsass/src/extend.cpp
1516 error   g++ '-DNODE_GYP_MODULE_NAME=libsass' '-DUSING_UV_SHARED=1' '-DUSING_V8_SHARED=1' '-DV8_DEPRECATION_WARNINGS=1' '-DV8_DEPRECATION_WARNINGS' '-DV8_IMMINENT_DEPRECATION_WARNINGS' '-D_GLIBCXX_USE_CXX11_ABI=1' '-D_LARGEFILE_SOURCE' '-D_FILE_OFFSET_BITS=64' '-D__STDC_FORMAT_MACROS' '-DLIBSASS_VERSION="3.5.5"' -I/home/cm/.node-gyp/16.11.1/include/node -I/home/cm/.node-gyp/16.11.1/src -I/home/cm/.node-gyp/16.11.1/deps/openssl/config -I/home/cm/.node-gyp/16.11.1/deps/openssl/openssl/include -I/home/cm/.node-gyp/16.11.1/deps/uv/include -I/home/cm/.node-gyp/16.11.1/deps/zlib -I/home/cm/.node-gyp/16.11.1/deps/v8/include -I../src/libsass/include  -fPIC -pthread -Wall -Wextra -Wno-unused-parameter -m64 -O3 -fno-omit-frame-pointer -std=gnu++14 -std=c++0x -fexceptions -frtti -MMD -MF ./Release/.deps/Release/obj.target/libsass/src/libsass/src/file.o.d.raw   -c -o Release/obj.target/libsass/src/libsass/src/file.o ../src/libsass/src/file.cpp
1516 error   g++ '-DNODE_GYP_MODULE_NAME=libsass' '-DUSING_UV_SHARED=1' '-DUSING_V8_SHARED=1' '-DV8_DEPRECATION_WARNINGS=1' '-DV8_DEPRECATION_WARNINGS' '-DV8_IMMINENT_DEPRECATION_WARNINGS' '-D_GLIBCXX_USE_CXX11_ABI=1' '-D_LARGEFILE_SOURCE' '-D_FILE_OFFSET_BITS=64' '-D__STDC_FORMAT_MACROS' '-DLIBSASS_VERSION="3.5.5"' -I/home/cm/.node-gyp/16.11.1/include/node -I/home/cm/.node-gyp/16.11.1/src -I/home/cm/.node-gyp/16.11.1/deps/openssl/config -I/home/cm/.node-gyp/16.11.1/deps/openssl/openssl/include -I/home/cm/.node-gyp/16.11.1/deps/uv/include -I/home/cm/.node-gyp/16.11.1/deps/zlib -I/home/cm/.node-gyp/16.11.1/deps/v8/include -I../src/libsass/include  -fPIC -pthread -Wall -Wextra -Wno-unused-parameter -m64 -O3 -fno-omit-frame-pointer -std=gnu++14 -std=c++0x -fexceptions -frtti -MMD -MF ./Release/.deps/Release/obj.target/libsass/src/libsass/src/functions.o.d.raw   -c -o Release/obj.target/libsass/src/libsass/src/functions.o ../src/libsass/src/functions.cpp
1516 error   g++ '-DNODE_GYP_MODULE_NAME=libsass' '-DUSING_UV_SHARED=1' '-DUSING_V8_SHARED=1' '-DV8_DEPRECATION_WARNINGS=1' '-DV8_DEPRECATION_WARNINGS' '-DV8_IMMINENT_DEPRECATION_WARNINGS' '-D_GLIBCXX_USE_CXX11_ABI=1' '-D_LARGEFILE_SOURCE' '-D_FILE_OFFSET_BITS=64' '-D__STDC_FORMAT_MACROS' '-DLIBSASS_VERSION="3.5.5"' -I/home/cm/.node-gyp/16.11.1/include/node -I/home/cm/.node-gyp/16.11.1/src -I/home/cm/.node-gyp/16.11.1/deps/openssl/config -I/home/cm/.node-gyp/16.11.1/deps/openssl/openssl/include -I/home/cm/.node-gyp/16.11.1/deps/uv/include -I/home/cm/.node-gyp/16.11.1/deps/zlib -I/home/cm/.node-gyp/16.11.1/deps/v8/include -I../src/libsass/include  -fPIC -pthread -Wall -Wextra -Wno-unused-parameter -m64 -O3 -fno-omit-frame-pointer -std=gnu++14 -std=c++0x -fexceptions -frtti -MMD -MF ./Release/.deps/Release/obj.target/libsass/src/libsass/src/inspect.o.d.raw   -c -o Release/obj.target/libsass/src/libsass/src/inspect.o ../src/libsass/src/inspect.cpp
1516 error   g++ '-DNODE_GYP_MODULE_NAME=libsass' '-DUSING_UV_SHARED=1' '-DUSING_V8_SHARED=1' '-DV8_DEPRECATION_WARNINGS=1' '-DV8_DEPRECATION_WARNINGS' '-DV8_IMMINENT_DEPRECATION_WARNINGS' '-D_GLIBCXX_USE_CXX11_ABI=1' '-D_LARGEFILE_SOURCE' '-D_FILE_OFFSET_BITS=64' '-D__STDC_FORMAT_MACROS' '-DLIBSASS_VERSION="3.5.5"' -I/home/cm/.node-gyp/16.11.1/include/node -I/home/cm/.node-gyp/16.11.1/src -I/home/cm/.node-gyp/16.11.1/deps/openssl/config -I/home/cm/.node-gyp/16.11.1/deps/openssl/openssl/include -I/home/cm/.node-gyp/16.11.1/deps/uv/include -I/home/cm/.node-gyp/16.11.1/deps/zlib -I/home/cm/.node-gyp/16.11.1/deps/v8/include -I../src/libsass/include  -fPIC -pthread -Wall -Wextra -Wno-unused-parameter -m64 -O3 -fno-omit-frame-pointer -std=gnu++14 -std=c++0x -fexceptions -frtti -MMD -MF ./Release/.deps/Release/obj.target/libsass/src/libsass/src/json.o.d.raw   -c -o Release/obj.target/libsass/src/libsass/src/json.o ../src/libsass/src/json.cpp
1516 error   g++ '-DNODE_GYP_MODULE_NAME=libsass' '-DUSING_UV_SHARED=1' '-DUSING_V8_SHARED=1' '-DV8_DEPRECATION_WARNINGS=1' '-DV8_DEPRECATION_WARNINGS' '-DV8_IMMINENT_DEPRECATION_WARNINGS' '-D_GLIBCXX_USE_CXX11_ABI=1' '-D_LARGEFILE_SOURCE' '-D_FILE_OFFSET_BITS=64' '-D__STDC_FORMAT_MACROS' '-DLIBSASS_VERSION="3.5.5"' -I/home/cm/.node-gyp/16.11.1/include/node -I/home/cm/.node-gyp/16.11.1/src -I/home/cm/.node-gyp/16.11.1/deps/openssl/config -I/home/cm/.node-gyp/16.11.1/deps/openssl/openssl/include -I/home/cm/.node-gyp/16.11.1/deps/uv/include -I/home/cm/.node-gyp/16.11.1/deps/zlib -I/home/cm/.node-gyp/16.11.1/deps/v8/include -I../src/libsass/include  -fPIC -pthread -Wall -Wextra -Wno-unused-parameter -m64 -O3 -fno-omit-frame-pointer -std=gnu++14 -std=c++0x -fexceptions -frtti -MMD -MF ./Release/.deps/Release/obj.target/libsass/src/libsass/src/lexer.o.d.raw   -c -o Release/obj.target/libsass/src/libsass/src/lexer.o ../src/libsass/src/lexer.cpp
1516 error   g++ '-DNODE_GYP_MODULE_NAME=libsass' '-DUSING_UV_SHARED=1' '-DUSING_V8_SHARED=1' '-DV8_DEPRECATION_WARNINGS=1' '-DV8_DEPRECATION_WARNINGS' '-DV8_IMMINENT_DEPRECATION_WARNINGS' '-D_GLIBCXX_USE_CXX11_ABI=1' '-D_LARGEFILE_SOURCE' '-D_FILE_OFFSET_BITS=64' '-D__STDC_FORMAT_MACROS' '-DLIBSASS_VERSION="3.5.5"' -I/home/cm/.node-gyp/16.11.1/include/node -I/home/cm/.node-gyp/16.11.1/src -I/home/cm/.node-gyp/16.11.1/deps/openssl/config -I/home/cm/.node-gyp/16.11.1/deps/openssl/openssl/include -I/home/cm/.node-gyp/16.11.1/deps/uv/include -I/home/cm/.node-gyp/16.11.1/deps/zlib -I/home/cm/.node-gyp/16.11.1/deps/v8/include -I../src/libsass/include  -fPIC -pthread -Wall -Wextra -Wno-unused-parameter -m64 -O3 -fno-omit-frame-pointer -std=gnu++14 -std=c++0x -fexceptions -frtti -MMD -MF ./Release/.deps/Release/obj.target/libsass/src/libsass/src/listize.o.d.raw   -c -o Release/obj.target/libsass/src/libsass/src/listize.o ../src/libsass/src/listize.cpp
1516 error   g++ '-DNODE_GYP_MODULE_NAME=libsass' '-DUSING_UV_SHARED=1' '-DUSING_V8_SHARED=1' '-DV8_DEPRECATION_WARNINGS=1' '-DV8_DEPRECATION_WARNINGS' '-DV8_IMMINENT_DEPRECATION_WARNINGS' '-D_GLIBCXX_USE_CXX11_ABI=1' '-D_LARGEFILE_SOURCE' '-D_FILE_OFFSET_BITS=64' '-D__STDC_FORMAT_MACROS' '-DLIBSASS_VERSION="3.5.5"' -I/home/cm/.node-gyp/16.11.1/include/node -I/home/cm/.node-gyp/16.11.1/src -I/home/cm/.node-gyp/16.11.1/deps/openssl/config -I/home/cm/.node-gyp/16.11.1/deps/openssl/openssl/include -I/home/cm/.node-gyp/16.11.1/deps/uv/include -I/home/cm/.node-gyp/16.11.1/deps/zlib -I/home/cm/.node-gyp/16.11.1/deps/v8/include -I../src/libsass/include  -fPIC -pthread -Wall -Wextra -Wno-unused-parameter -m64 -O3 -fno-omit-frame-pointer -std=gnu++14 -std=c++0x -fexceptions -frtti -MMD -MF ./Release/.deps/Release/obj.target/libsass/src/libsass/src/memory/SharedPtr.o.d.raw   -c -o Release/obj.target/libsass/src/libsass/src/memory/SharedPtr.o ../src/libsass/src/memory/SharedPtr.cpp
1516 error   g++ '-DNODE_GYP_MODULE_NAME=libsass' '-DUSING_UV_SHARED=1' '-DUSING_V8_SHARED=1' '-DV8_DEPRECATION_WARNINGS=1' '-DV8_DEPRECATION_WARNINGS' '-DV8_IMMINENT_DEPRECATION_WARNINGS' '-D_GLIBCXX_USE_CXX11_ABI=1' '-D_LARGEFILE_SOURCE' '-D_FILE_OFFSET_BITS=64' '-D__STDC_FORMAT_MACROS' '-DLIBSASS_VERSION="3.5.5"' -I/home/cm/.node-gyp/16.11.1/include/node -I/home/cm/.node-gyp/16.11.1/src -I/home/cm/.node-gyp/16.11.1/deps/openssl/config -I/home/cm/.node-gyp/16.11.1/deps/openssl/openssl/include -I/home/cm/.node-gyp/16.11.1/deps/uv/include -I/home/cm/.node-gyp/16.11.1/deps/zlib -I/home/cm/.node-gyp/16.11.1/deps/v8/include -I../src/libsass/include  -fPIC -pthread -Wall -Wextra -Wno-unused-parameter -m64 -O3 -fno-omit-frame-pointer -std=gnu++14 -std=c++0x -fexceptions -frtti -MMD -MF ./Release/.deps/Release/obj.target/libsass/src/libsass/src/node.o.d.raw   -c -o Release/obj.target/libsass/src/libsass/src/node.o ../src/libsass/src/node.cpp
1516 error   g++ '-DNODE_GYP_MODULE_NAME=libsass' '-DUSING_UV_SHARED=1' '-DUSING_V8_SHARED=1' '-DV8_DEPRECATION_WARNINGS=1' '-DV8_DEPRECATION_WARNINGS' '-DV8_IMMINENT_DEPRECATION_WARNINGS' '-D_GLIBCXX_USE_CXX11_ABI=1' '-D_LARGEFILE_SOURCE' '-D_FILE_OFFSET_BITS=64' '-D__STDC_FORMAT_MACROS' '-DLIBSASS_VERSION="3.5.5"' -I/home/cm/.node-gyp/16.11.1/include/node -I/home/cm/.node-gyp/16.11.1/src -I/home/cm/.node-gyp/16.11.1/deps/openssl/config -I/home/cm/.node-gyp/16.11.1/deps/openssl/openssl/include -I/home/cm/.node-gyp/16.11.1/deps/uv/include -I/home/cm/.node-gyp/16.11.1/deps/zlib -I/home/cm/.node-gyp/16.11.1/deps/v8/include -I../src/libsass/include  -fPIC -pthread -Wall -Wextra -Wno-unused-parameter -m64 -O3 -fno-omit-frame-pointer -std=gnu++14 -std=c++0x -fexceptions -frtti -MMD -MF ./Release/.deps/Release/obj.target/libsass/src/libsass/src/operators.o.d.raw   -c -o Release/obj.target/libsass/src/libsass/src/operators.o ../src/libsass/src/operators.cpp
1516 error   g++ '-DNODE_GYP_MODULE_NAME=libsass' '-DUSING_UV_SHARED=1' '-DUSING_V8_SHARED=1' '-DV8_DEPRECATION_WARNINGS=1' '-DV8_DEPRECATION_WARNINGS' '-DV8_IMMINENT_DEPRECATION_WARNINGS' '-D_GLIBCXX_USE_CXX11_ABI=1' '-D_LARGEFILE_SOURCE' '-D_FILE_OFFSET_BITS=64' '-D__STDC_FORMAT_MACROS' '-DLIBSASS_VERSION="3.5.5"' -I/home/cm/.node-gyp/16.11.1/include/node -I/home/cm/.node-gyp/16.11.1/src -I/home/cm/.node-gyp/16.11.1/deps/openssl/config -I/home/cm/.node-gyp/16.11.1/deps/openssl/openssl/include -I/home/cm/.node-gyp/16.11.1/deps/uv/include -I/home/cm/.node-gyp/16.11.1/deps/zlib -I/home/cm/.node-gyp/16.11.1/deps/v8/include -I../src/libsass/include  -fPIC -pthread -Wall -Wextra -Wno-unused-parameter -m64 -O3 -fno-omit-frame-pointer -std=gnu++14 -std=c++0x -fexceptions -frtti -MMD -MF ./Release/.deps/Release/obj.target/libsass/src/libsass/src/output.o.d.raw   -c -o Release/obj.target/libsass/src/libsass/src/output.o ../src/libsass/src/output.cpp
1516 error   g++ '-DNODE_GYP_MODULE_NAME=libsass' '-DUSING_UV_SHARED=1' '-DUSING_V8_SHARED=1' '-DV8_DEPRECATION_WARNINGS=1' '-DV8_DEPRECATION_WARNINGS' '-DV8_IMMINENT_DEPRECATION_WARNINGS' '-D_GLIBCXX_USE_CXX11_ABI=1' '-D_LARGEFILE_SOURCE' '-D_FILE_OFFSET_BITS=64' '-D__STDC_FORMAT_MACROS' '-DLIBSASS_VERSION="3.5.5"' -I/home/cm/.node-gyp/16.11.1/include/node -I/home/cm/.node-gyp/16.11.1/src -I/home/cm/.node-gyp/16.11.1/deps/openssl/config -I/home/cm/.node-gyp/16.11.1/deps/openssl/openssl/include -I/home/cm/.node-gyp/16.11.1/deps/uv/include -I/home/cm/.node-gyp/16.11.1/deps/zlib -I/home/cm/.node-gyp/16.11.1/deps/v8/include -I../src/libsass/include  -fPIC -pthread -Wall -Wextra -Wno-unused-parameter -m64 -O3 -fno-omit-frame-pointer -std=gnu++14 -std=c++0x -fexceptions -frtti -MMD -MF ./Release/.deps/Release/obj.target/libsass/src/libsass/src/parser.o.d.raw   -c -o Release/obj.target/libsass/src/libsass/src/parser.o ../src/libsass/src/parser.cpp
1516 error   g++ '-DNODE_GYP_MODULE_NAME=libsass' '-DUSING_UV_SHARED=1' '-DUSING_V8_SHARED=1' '-DV8_DEPRECATION_WARNINGS=1' '-DV8_DEPRECATION_WARNINGS' '-DV8_IMMINENT_DEPRECATION_WARNINGS' '-D_GLIBCXX_USE_CXX11_ABI=1' '-D_LARGEFILE_SOURCE' '-D_FILE_OFFSET_BITS=64' '-D__STDC_FORMAT_MACROS' '-DLIBSASS_VERSION="3.5.5"' -I/home/cm/.node-gyp/16.11.1/include/node -I/home/cm/.node-gyp/16.11.1/src -I/home/cm/.node-gyp/16.11.1/deps/openssl/config -I/home/cm/.node-gyp/16.11.1/deps/openssl/openssl/include -I/home/cm/.node-gyp/16.11.1/deps/uv/include -I/home/cm/.node-gyp/16.11.1/deps/zlib -I/home/cm/.node-gyp/16.11.1/deps/v8/include -I../src/libsass/include  -fPIC -pthread -Wall -Wextra -Wno-unused-parameter -m64 -O3 -fno-omit-frame-pointer -std=gnu++14 -std=c++0x -fexceptions -frtti -MMD -MF ./Release/.deps/Release/obj.target/libsass/src/libsass/src/plugins.o.d.raw   -c -o Release/obj.target/libsass/src/libsass/src/plugins.o ../src/libsass/src/plugins.cpp
1516 error   g++ '-DNODE_GYP_MODULE_NAME=libsass' '-DUSING_UV_SHARED=1' '-DUSING_V8_SHARED=1' '-DV8_DEPRECATION_WARNINGS=1' '-DV8_DEPRECATION_WARNINGS' '-DV8_IMMINENT_DEPRECATION_WARNINGS' '-D_GLIBCXX_USE_CXX11_ABI=1' '-D_LARGEFILE_SOURCE' '-D_FILE_OFFSET_BITS=64' '-D__STDC_FORMAT_MACROS' '-DLIBSASS_VERSION="3.5.5"' -I/home/cm/.node-gyp/16.11.1/include/node -I/home/cm/.node-gyp/16.11.1/src -I/home/cm/.node-gyp/16.11.1/deps/openssl/config -I/home/cm/.node-gyp/16.11.1/deps/openssl/openssl/include -I/home/cm/.node-gyp/16.11.1/deps/uv/include -I/home/cm/.node-gyp/16.11.1/deps/zlib -I/home/cm/.node-gyp/16.11.1/deps/v8/include -I../src/libsass/include  -fPIC -pthread -Wall -Wextra -Wno-unused-parameter -m64 -O3 -fno-omit-frame-pointer -std=gnu++14 -std=c++0x -fexceptions -frtti -MMD -MF ./Release/.deps/Release/obj.target/libsass/src/libsass/src/position.o.d.raw   -c -o Release/obj.target/libsass/src/libsass/src/position.o ../src/libsass/src/position.cpp
1516 error   g++ '-DNODE_GYP_MODULE_NAME=libsass' '-DUSING_UV_SHARED=1' '-DUSING_V8_SHARED=1' '-DV8_DEPRECATION_WARNINGS=1' '-DV8_DEPRECATION_WARNINGS' '-DV8_IMMINENT_DEPRECATION_WARNINGS' '-D_GLIBCXX_USE_CXX11_ABI=1' '-D_LARGEFILE_SOURCE' '-D_FILE_OFFSET_BITS=64' '-D__STDC_FORMAT_MACROS' '-DLIBSASS_VERSION="3.5.5"' -I/home/cm/.node-gyp/16.11.1/include/node -I/home/cm/.node-gyp/16.11.1/src -I/home/cm/.node-gyp/16.11.1/deps/openssl/config -I/home/cm/.node-gyp/16.11.1/deps/openssl/openssl/include -I/home/cm/.node-gyp/16.11.1/deps/uv/include -I/home/cm/.node-gyp/16.11.1/deps/zlib -I/home/cm/.node-gyp/16.11.1/deps/v8/include -I../src/libsass/include  -fPIC -pthread -Wall -Wextra -Wno-unused-parameter -m64 -O3 -fno-omit-frame-pointer -std=gnu++14 -std=c++0x -fexceptions -frtti -MMD -MF ./Release/.deps/Release/obj.target/libsass/src/libsass/src/prelexer.o.d.raw   -c -o Release/obj.target/libsass/src/libsass/src/prelexer.o ../src/libsass/src/prelexer.cpp
1516 error   g++ '-DNODE_GYP_MODULE_NAME=libsass' '-DUSING_UV_SHARED=1' '-DUSING_V8_SHARED=1' '-DV8_DEPRECATION_WARNINGS=1' '-DV8_DEPRECATION_WARNINGS' '-DV8_IMMINENT_DEPRECATION_WARNINGS' '-D_GLIBCXX_USE_CXX11_ABI=1' '-D_LARGEFILE_SOURCE' '-D_FILE_OFFSET_BITS=64' '-D__STDC_FORMAT_MACROS' '-DLIBSASS_VERSION="3.5.5"' -I/home/cm/.node-gyp/16.11.1/include/node -I/home/cm/.node-gyp/16.11.1/src -I/home/cm/.node-gyp/16.11.1/deps/openssl/config -I/home/cm/.node-gyp/16.11.1/deps/openssl/openssl/include -I/home/cm/.node-gyp/16.11.1/deps/uv/include -I/home/cm/.node-gyp/16.11.1/deps/zlib -I/home/cm/.node-gyp/16.11.1/deps/v8/include -I../src/libsass/include  -fPIC -pthread -Wall -Wextra -Wno-unused-parameter -m64 -O3 -fno-omit-frame-pointer -std=gnu++14 -std=c++0x -fexceptions -frtti -MMD -MF ./Release/.deps/Release/obj.target/libsass/src/libsass/src/remove_placeholders.o.d.raw   -c -o Release/obj.target/libsass/src/libsass/src/remove_placeholders.o ../src/libsass/src/remove_placeholders.cpp
1516 error   g++ '-DNODE_GYP_MODULE_NAME=libsass' '-DUSING_UV_SHARED=1' '-DUSING_V8_SHARED=1' '-DV8_DEPRECATION_WARNINGS=1' '-DV8_DEPRECATION_WARNINGS' '-DV8_IMMINENT_DEPRECATION_WARNINGS' '-D_GLIBCXX_USE_CXX11_ABI=1' '-D_LARGEFILE_SOURCE' '-D_FILE_OFFSET_BITS=64' '-D__STDC_FORMAT_MACROS' '-DLIBSASS_VERSION="3.5.5"' -I/home/cm/.node-gyp/16.11.1/include/node -I/home/cm/.node-gyp/16.11.1/src -I/home/cm/.node-gyp/16.11.1/deps/openssl/config -I/home/cm/.node-gyp/16.11.1/deps/openssl/openssl/include -I/home/cm/.node-gyp/16.11.1/deps/uv/include -I/home/cm/.node-gyp/16.11.1/deps/zlib -I/home/cm/.node-gyp/16.11.1/deps/v8/include -I../src/libsass/include  -fPIC -pthread -Wall -Wextra -Wno-unused-parameter -m64 -O3 -fno-omit-frame-pointer -std=gnu++14 -std=c++0x -fexceptions -frtti -MMD -MF ./Release/.deps/Release/obj.target/libsass/src/libsass/src/sass.o.d.raw   -c -o Release/obj.target/libsass/src/libsass/src/sass.o ../src/libsass/src/sass.cpp
1516 error   g++ '-DNODE_GYP_MODULE_NAME=libsass' '-DUSING_UV_SHARED=1' '-DUSING_V8_SHARED=1' '-DV8_DEPRECATION_WARNINGS=1' '-DV8_DEPRECATION_WARNINGS' '-DV8_IMMINENT_DEPRECATION_WARNINGS' '-D_GLIBCXX_USE_CXX11_ABI=1' '-D_LARGEFILE_SOURCE' '-D_FILE_OFFSET_BITS=64' '-D__STDC_FORMAT_MACROS' '-DLIBSASS_VERSION="3.5.5"' -I/home/cm/.node-gyp/16.11.1/include/node -I/home/cm/.node-gyp/16.11.1/src -I/home/cm/.node-gyp/16.11.1/deps/openssl/config -I/home/cm/.node-gyp/16.11.1/deps/openssl/openssl/include -I/home/cm/.node-gyp/16.11.1/deps/uv/include -I/home/cm/.node-gyp/16.11.1/deps/zlib -I/home/cm/.node-gyp/16.11.1/deps/v8/include -I../src/libsass/include  -fPIC -pthread -Wall -Wextra -Wno-unused-parameter -m64 -O3 -fno-omit-frame-pointer -std=gnu++14 -std=c++0x -fexceptions -frtti -MMD -MF ./Release/.deps/Release/obj.target/libsass/src/libsass/src/sass2scss.o.d.raw   -c -o Release/obj.target/libsass/src/libsass/src/sass2scss.o ../src/libsass/src/sass2scss.cpp
1516 error   g++ '-DNODE_GYP_MODULE_NAME=libsass' '-DUSING_UV_SHARED=1' '-DUSING_V8_SHARED=1' '-DV8_DEPRECATION_WARNINGS=1' '-DV8_DEPRECATION_WARNINGS' '-DV8_IMMINENT_DEPRECATION_WARNINGS' '-D_GLIBCXX_USE_CXX11_ABI=1' '-D_LARGEFILE_SOURCE' '-D_FILE_OFFSET_BITS=64' '-D__STDC_FORMAT_MACROS' '-DLIBSASS_VERSION="3.5.5"' -I/home/cm/.node-gyp/16.11.1/include/node -I/home/cm/.node-gyp/16.11.1/src -I/home/cm/.node-gyp/16.11.1/deps/openssl/config -I/home/cm/.node-gyp/16.11.1/deps/openssl/openssl/include -I/home/cm/.node-gyp/16.11.1/deps/uv/include -I/home/cm/.node-gyp/16.11.1/deps/zlib -I/home/cm/.node-gyp/16.11.1/deps/v8/include -I../src/libsass/include  -fPIC -pthread -Wall -Wextra -Wno-unused-parameter -m64 -O3 -fno-omit-frame-pointer -std=gnu++14 -std=c++0x -fexceptions -frtti -MMD -MF ./Release/.deps/Release/obj.target/libsass/src/libsass/src/sass_context.o.d.raw   -c -o Release/obj.target/libsass/src/libsass/src/sass_context.o ../src/libsass/src/sass_context.cpp
1516 error   g++ '-DNODE_GYP_MODULE_NAME=libsass' '-DUSING_UV_SHARED=1' '-DUSING_V8_SHARED=1' '-DV8_DEPRECATION_WARNINGS=1' '-DV8_DEPRECATION_WARNINGS' '-DV8_IMMINENT_DEPRECATION_WARNINGS' '-D_GLIBCXX_USE_CXX11_ABI=1' '-D_LARGEFILE_SOURCE' '-D_FILE_OFFSET_BITS=64' '-D__STDC_FORMAT_MACROS' '-DLIBSASS_VERSION="3.5.5"' -I/home/cm/.node-gyp/16.11.1/include/node -I/home/cm/.node-gyp/16.11.1/src -I/home/cm/.node-gyp/16.11.1/deps/openssl/config -I/home/cm/.node-gyp/16.11.1/deps/openssl/openssl/include -I/home/cm/.node-gyp/16.11.1/deps/uv/include -I/home/cm/.node-gyp/16.11.1/deps/zlib -I/home/cm/.node-gyp/16.11.1/deps/v8/include -I../src/libsass/include  -fPIC -pthread -Wall -Wextra -Wno-unused-parameter -m64 -O3 -fno-omit-frame-pointer -std=gnu++14 -std=c++0x -fexceptions -frtti -MMD -MF ./Release/.deps/Release/obj.target/libsass/src/libsass/src/sass_functions.o.d.raw   -c -o Release/obj.target/libsass/src/libsass/src/sass_functions.o ../src/libsass/src/sass_functions.cpp
1516 error   g++ '-DNODE_GYP_MODULE_NAME=libsass' '-DUSING_UV_SHARED=1' '-DUSING_V8_SHARED=1' '-DV8_DEPRECATION_WARNINGS=1' '-DV8_DEPRECATION_WARNINGS' '-DV8_IMMINENT_DEPRECATION_WARNINGS' '-D_GLIBCXX_USE_CXX11_ABI=1' '-D_LARGEFILE_SOURCE' '-D_FILE_OFFSET_BITS=64' '-D__STDC_FORMAT_MACROS' '-DLIBSASS_VERSION="3.5.5"' -I/home/cm/.node-gyp/16.11.1/include/node -I/home/cm/.node-gyp/16.11.1/src -I/home/cm/.node-gyp/16.11.1/deps/openssl/config -I/home/cm/.node-gyp/16.11.1/deps/openssl/openssl/include -I/home/cm/.node-gyp/16.11.1/deps/uv/include -I/home/cm/.node-gyp/16.11.1/deps/zlib -I/home/cm/.node-gyp/16.11.1/deps/v8/include -I../src/libsass/include  -fPIC -pthread -Wall -Wextra -Wno-unused-parameter -m64 -O3 -fno-omit-frame-pointer -std=gnu++14 -std=c++0x -fexceptions -frtti -MMD -MF ./Release/.deps/Release/obj.target/libsass/src/libsass/src/sass_util.o.d.raw   -c -o Release/obj.target/libsass/src/libsass/src/sass_util.o ../src/libsass/src/sass_util.cpp
1516 error   g++ '-DNODE_GYP_MODULE_NAME=libsass' '-DUSING_UV_SHARED=1' '-DUSING_V8_SHARED=1' '-DV8_DEPRECATION_WARNINGS=1' '-DV8_DEPRECATION_WARNINGS' '-DV8_IMMINENT_DEPRECATION_WARNINGS' '-D_GLIBCXX_USE_CXX11_ABI=1' '-D_LARGEFILE_SOURCE' '-D_FILE_OFFSET_BITS=64' '-D__STDC_FORMAT_MACROS' '-DLIBSASS_VERSION="3.5.5"' -I/home/cm/.node-gyp/16.11.1/include/node -I/home/cm/.node-gyp/16.11.1/src -I/home/cm/.node-gyp/16.11.1/deps/openssl/config -I/home/cm/.node-gyp/16.11.1/deps/openssl/openssl/include -I/home/cm/.node-gyp/16.11.1/deps/uv/include -I/home/cm/.node-gyp/16.11.1/deps/zlib -I/home/cm/.node-gyp/16.11.1/deps/v8/include -I../src/libsass/include  -fPIC -pthread -Wall -Wextra -Wno-unused-parameter -m64 -O3 -fno-omit-frame-pointer -std=gnu++14 -std=c++0x -fexceptions -frtti -MMD -MF ./Release/.deps/Release/obj.target/libsass/src/libsass/src/sass_values.o.d.raw   -c -o Release/obj.target/libsass/src/libsass/src/sass_values.o ../src/libsass/src/sass_values.cpp
1516 error   g++ '-DNODE_GYP_MODULE_NAME=libsass' '-DUSING_UV_SHARED=1' '-DUSING_V8_SHARED=1' '-DV8_DEPRECATION_WARNINGS=1' '-DV8_DEPRECATION_WARNINGS' '-DV8_IMMINENT_DEPRECATION_WARNINGS' '-D_GLIBCXX_USE_CXX11_ABI=1' '-D_LARGEFILE_SOURCE' '-D_FILE_OFFSET_BITS=64' '-D__STDC_FORMAT_MACROS' '-DLIBSASS_VERSION="3.5.5"' -I/home/cm/.node-gyp/16.11.1/include/node -I/home/cm/.node-gyp/16.11.1/src -I/home/cm/.node-gyp/16.11.1/deps/openssl/config -I/home/cm/.node-gyp/16.11.1/deps/openssl/openssl/include -I/home/cm/.node-gyp/16.11.1/deps/uv/include -I/home/cm/.node-gyp/16.11.1/deps/zlib -I/home/cm/.node-gyp/16.11.1/deps/v8/include -I../src/libsass/include  -fPIC -pthread -Wall -Wextra -Wno-unused-parameter -m64 -O3 -fno-omit-frame-pointer -std=gnu++14 -std=c++0x -fexceptions -frtti -MMD -MF ./Release/.deps/Release/obj.target/libsass/src/libsass/src/source_map.o.d.raw   -c -o Release/obj.target/libsass/src/libsass/src/source_map.o ../src/libsass/src/source_map.cpp
1516 error   g++ '-DNODE_GYP_MODULE_NAME=libsass' '-DUSING_UV_SHARED=1' '-DUSING_V8_SHARED=1' '-DV8_DEPRECATION_WARNINGS=1' '-DV8_DEPRECATION_WARNINGS' '-DV8_IMMINENT_DEPRECATION_WARNINGS' '-D_GLIBCXX_USE_CXX11_ABI=1' '-D_LARGEFILE_SOURCE' '-D_FILE_OFFSET_BITS=64' '-D__STDC_FORMAT_MACROS' '-DLIBSASS_VERSION="3.5.5"' -I/home/cm/.node-gyp/16.11.1/include/node -I/home/cm/.node-gyp/16.11.1/src -I/home/cm/.node-gyp/16.11.1/deps/openssl/config -I/home/cm/.node-gyp/16.11.1/deps/openssl/openssl/include -I/home/cm/.node-gyp/16.11.1/deps/uv/include -I/home/cm/.node-gyp/16.11.1/deps/zlib -I/home/cm/.node-gyp/16.11.1/deps/v8/include -I../src/libsass/include  -fPIC -pthread -Wall -Wextra -Wno-unused-parameter -m64 -O3 -fno-omit-frame-pointer -std=gnu++14 -std=c++0x -fexceptions -frtti -MMD -MF ./Release/.deps/Release/obj.target/libsass/src/libsass/src/subset_map.o.d.raw   -c -o Release/obj.target/libsass/src/libsass/src/subset_map.o ../src/libsass/src/subset_map.cpp
1516 error   g++ '-DNODE_GYP_MODULE_NAME=libsass' '-DUSING_UV_SHARED=1' '-DUSING_V8_SHARED=1' '-DV8_DEPRECATION_WARNINGS=1' '-DV8_DEPRECATION_WARNINGS' '-DV8_IMMINENT_DEPRECATION_WARNINGS' '-D_GLIBCXX_USE_CXX11_ABI=1' '-D_LARGEFILE_SOURCE' '-D_FILE_OFFSET_BITS=64' '-D__STDC_FORMAT_MACROS' '-DLIBSASS_VERSION="3.5.5"' -I/home/cm/.node-gyp/16.11.1/include/node -I/home/cm/.node-gyp/16.11.1/src -I/home/cm/.node-gyp/16.11.1/deps/openssl/config -I/home/cm/.node-gyp/16.11.1/deps/openssl/openssl/include -I/home/cm/.node-gyp/16.11.1/deps/uv/include -I/home/cm/.node-gyp/16.11.1/deps/zlib -I/home/cm/.node-gyp/16.11.1/deps/v8/include -I../src/libsass/include  -fPIC -pthread -Wall -Wextra -Wno-unused-parameter -m64 -O3 -fno-omit-frame-pointer -std=gnu++14 -std=c++0x -fexceptions -frtti -MMD -MF ./Release/.deps/Release/obj.target/libsass/src/libsass/src/to_c.o.d.raw   -c -o Release/obj.target/libsass/src/libsass/src/to_c.o ../src/libsass/src/to_c.cpp
1516 error   g++ '-DNODE_GYP_MODULE_NAME=libsass' '-DUSING_UV_SHARED=1' '-DUSING_V8_SHARED=1' '-DV8_DEPRECATION_WARNINGS=1' '-DV8_DEPRECATION_WARNINGS' '-DV8_IMMINENT_DEPRECATION_WARNINGS' '-D_GLIBCXX_USE_CXX11_ABI=1' '-D_LARGEFILE_SOURCE' '-D_FILE_OFFSET_BITS=64' '-D__STDC_FORMAT_MACROS' '-DLIBSASS_VERSION="3.5.5"' -I/home/cm/.node-gyp/16.11.1/include/node -I/home/cm/.node-gyp/16.11.1/src -I/home/cm/.node-gyp/16.11.1/deps/openssl/config -I/home/cm/.node-gyp/16.11.1/deps/openssl/openssl/include -I/home/cm/.node-gyp/16.11.1/deps/uv/include -I/home/cm/.node-gyp/16.11.1/deps/zlib -I/home/cm/.node-gyp/16.11.1/deps/v8/include -I../src/libsass/include  -fPIC -pthread -Wall -Wextra -Wno-unused-parameter -m64 -O3 -fno-omit-frame-pointer -std=gnu++14 -std=c++0x -fexceptions -frtti -MMD -MF ./Release/.deps/Release/obj.target/libsass/src/libsass/src/to_value.o.d.raw   -c -o Release/obj.target/libsass/src/libsass/src/to_value.o ../src/libsass/src/to_value.cpp
1516 error   g++ '-DNODE_GYP_MODULE_NAME=libsass' '-DUSING_UV_SHARED=1' '-DUSING_V8_SHARED=1' '-DV8_DEPRECATION_WARNINGS=1' '-DV8_DEPRECATION_WARNINGS' '-DV8_IMMINENT_DEPRECATION_WARNINGS' '-D_GLIBCXX_USE_CXX11_ABI=1' '-D_LARGEFILE_SOURCE' '-D_FILE_OFFSET_BITS=64' '-D__STDC_FORMAT_MACROS' '-DLIBSASS_VERSION="3.5.5"' -I/home/cm/.node-gyp/16.11.1/include/node -I/home/cm/.node-gyp/16.11.1/src -I/home/cm/.node-gyp/16.11.1/deps/openssl/config -I/home/cm/.node-gyp/16.11.1/deps/openssl/openssl/include -I/home/cm/.node-gyp/16.11.1/deps/uv/include -I/home/cm/.node-gyp/16.11.1/deps/zlib -I/home/cm/.node-gyp/16.11.1/deps/v8/include -I../src/libsass/include  -fPIC -pthread -Wall -Wextra -Wno-unused-parameter -m64 -O3 -fno-omit-frame-pointer -std=gnu++14 -std=c++0x -fexceptions -frtti -MMD -MF ./Release/.deps/Release/obj.target/libsass/src/libsass/src/units.o.d.raw   -c -o Release/obj.target/libsass/src/libsass/src/units.o ../src/libsass/src/units.cpp
1516 error   g++ '-DNODE_GYP_MODULE_NAME=libsass' '-DUSING_UV_SHARED=1' '-DUSING_V8_SHARED=1' '-DV8_DEPRECATION_WARNINGS=1' '-DV8_DEPRECATION_WARNINGS' '-DV8_IMMINENT_DEPRECATION_WARNINGS' '-D_GLIBCXX_USE_CXX11_ABI=1' '-D_LARGEFILE_SOURCE' '-D_FILE_OFFSET_BITS=64' '-D__STDC_FORMAT_MACROS' '-DLIBSASS_VERSION="3.5.5"' -I/home/cm/.node-gyp/16.11.1/include/node -I/home/cm/.node-gyp/16.11.1/src -I/home/cm/.node-gyp/16.11.1/deps/openssl/config -I/home/cm/.node-gyp/16.11.1/deps/openssl/openssl/include -I/home/cm/.node-gyp/16.11.1/deps/uv/include -I/home/cm/.node-gyp/16.11.1/deps/zlib -I/home/cm/.node-gyp/16.11.1/deps/v8/include -I../src/libsass/include  -fPIC -pthread -Wall -Wextra -Wno-unused-parameter -m64 -O3 -fno-omit-frame-pointer -std=gnu++14 -std=c++0x -fexceptions -frtti -MMD -MF ./Release/.deps/Release/obj.target/libsass/src/libsass/src/utf8_string.o.d.raw   -c -o Release/obj.target/libsass/src/libsass/src/utf8_string.o ../src/libsass/src/utf8_string.cpp
1516 error   g++ '-DNODE_GYP_MODULE_NAME=libsass' '-DUSING_UV_SHARED=1' '-DUSING_V8_SHARED=1' '-DV8_DEPRECATION_WARNINGS=1' '-DV8_DEPRECATION_WARNINGS' '-DV8_IMMINENT_DEPRECATION_WARNINGS' '-D_GLIBCXX_USE_CXX11_ABI=1' '-D_LARGEFILE_SOURCE' '-D_FILE_OFFSET_BITS=64' '-D__STDC_FORMAT_MACROS' '-DLIBSASS_VERSION="3.5.5"' -I/home/cm/.node-gyp/16.11.1/include/node -I/home/cm/.node-gyp/16.11.1/src -I/home/cm/.node-gyp/16.11.1/deps/openssl/config -I/home/cm/.node-gyp/16.11.1/deps/openssl/openssl/include -I/home/cm/.node-gyp/16.11.1/deps/uv/include -I/home/cm/.node-gyp/16.11.1/deps/zlib -I/home/cm/.node-gyp/16.11.1/deps/v8/include -I../src/libsass/include  -fPIC -pthread -Wall -Wextra -Wno-unused-parameter -m64 -O3 -fno-omit-frame-pointer -std=gnu++14 -std=c++0x -fexceptions -frtti -MMD -MF ./Release/.deps/Release/obj.target/libsass/src/libsass/src/util.o.d.raw   -c -o Release/obj.target/libsass/src/libsass/src/util.o ../src/libsass/src/util.cpp
1516 error   g++ '-DNODE_GYP_MODULE_NAME=libsass' '-DUSING_UV_SHARED=1' '-DUSING_V8_SHARED=1' '-DV8_DEPRECATION_WARNINGS=1' '-DV8_DEPRECATION_WARNINGS' '-DV8_IMMINENT_DEPRECATION_WARNINGS' '-D_GLIBCXX_USE_CXX11_ABI=1' '-D_LARGEFILE_SOURCE' '-D_FILE_OFFSET_BITS=64' '-D__STDC_FORMAT_MACROS' '-DLIBSASS_VERSION="3.5.5"' -I/home/cm/.node-gyp/16.11.1/include/node -I/home/cm/.node-gyp/16.11.1/src -I/home/cm/.node-gyp/16.11.1/deps/openssl/config -I/home/cm/.node-gyp/16.11.1/deps/openssl/openssl/include -I/home/cm/.node-gyp/16.11.1/deps/uv/include -I/home/cm/.node-gyp/16.11.1/deps/zlib -I/home/cm/.node-gyp/16.11.1/deps/v8/include -I../src/libsass/include  -fPIC -pthread -Wall -Wextra -Wno-unused-parameter -m64 -O3 -fno-omit-frame-pointer -std=gnu++14 -std=c++0x -fexceptions -frtti -MMD -MF ./Release/.deps/Release/obj.target/libsass/src/libsass/src/values.o.d.raw   -c -o Release/obj.target/libsass/src/libsass/src/values.o ../src/libsass/src/values.cpp
1516 error   rm -f Release/obj.target/src/sass.a && ar crs Release/obj.target/src/sass.a Release/obj.target/libsass/src/libsass/src/ast.o Release/obj.target/libsass/src/libsass/src/ast_fwd_decl.o Release/obj.target/libsass/src/libsass/src/backtrace.o Release/obj.target/libsass/src/libsass/src/base64vlq.o Release/obj.target/libsass/src/libsass/src/bind.o Release/obj.target/libsass/src/libsass/src/cencode.o Release/obj.target/libsass/src/libsass/src/check_nesting.o Release/obj.target/libsass/src/libsass/src/color_maps.o Release/obj.target/libsass/src/libsass/src/constants.o Release/obj.target/libsass/src/libsass/src/context.o Release/obj.target/libsass/src/libsass/src/cssize.o Release/obj.target/libsass/src/libsass/src/emitter.o Release/obj.target/libsass/src/libsass/src/environment.o Release/obj.target/libsass/src/libsass/src/error_handling.o Release/obj.target/libsass/src/libsass/src/eval.o Release/obj.target/libsass/src/libsass/src/expand.o Release/obj.target/libsass/src/libsass/src/extend.o Release/obj.target/libsass/src/libsass/src/file.o Release/obj.target/libsass/src/libsass/src/functions.o Release/obj.target/libsass/src/libsass/src/inspect.o Release/obj.target/libsass/src/libsass/src/json.o Release/obj.target/libsass/src/libsass/src/lexer.o Release/obj.target/libsass/src/libsass/src/listize.o Release/obj.target/libsass/src/libsass/src/memory/SharedPtr.o Release/obj.target/libsass/src/libsass/src/node.o Release/obj.target/libsass/src/libsass/src/operators.o Release/obj.target/libsass/src/libsass/src/output.o Release/obj.target/libsass/src/libsass/src/parser.o Release/obj.target/libsass/src/libsass/src/plugins.o Release/obj.target/libsass/src/libsass/src/position.o Release/obj.target/libsass/src/libsass/src/prelexer.o Release/obj.target/libsass/src/libsass/src/remove_placeholders.o Release/obj.target/libsass/src/libsass/src/sass.o Release/obj.target/libsass/src/libsass/src/sass2scss.o Release/obj.target/libsass/src/libsass/src/sass_context.o Release/obj.target/libsass/src/libsass/src/sass_functions.o Release/obj.target/libsass/src/libsass/src/sass_util.o Release/obj.target/libsass/src/libsass/src/sass_values.o Release/obj.target/libsass/src/libsass/src/source_map.o Release/obj.target/libsass/src/libsass/src/subset_map.o Release/obj.target/libsass/src/libsass/src/to_c.o Release/obj.target/libsass/src/libsass/src/to_value.o Release/obj.target/libsass/src/libsass/src/units.o Release/obj.target/libsass/src/libsass/src/utf8_string.o Release/obj.target/libsass/src/libsass/src/util.o Release/obj.target/libsass/src/libsass/src/values.o
1516 error   rm -rf "Release/sass.a" && cp -af "Release/obj.target/src/sass.a" "Release/sass.a"
1516 error   g++ '-DNODE_GYP_MODULE_NAME=binding' '-DUSING_UV_SHARED=1' '-DUSING_V8_SHARED=1' '-DV8_DEPRECATION_WARNINGS=1' '-DV8_DEPRECATION_WARNINGS' '-DV8_IMMINENT_DEPRECATION_WARNINGS' '-D_GLIBCXX_USE_CXX11_ABI=1' '-D_LARGEFILE_SOURCE' '-D_FILE_OFFSET_BITS=64' '-D__STDC_FORMAT_MACROS' '-DBUILDING_NODE_EXTENSION' -I/home/cm/.node-gyp/16.11.1/include/node -I/home/cm/.node-gyp/16.11.1/src -I/home/cm/.node-gyp/16.11.1/deps/openssl/config -I/home/cm/.node-gyp/16.11.1/deps/openssl/openssl/include -I/home/cm/.node-gyp/16.11.1/deps/uv/include -I/home/cm/.node-gyp/16.11.1/deps/zlib -I/home/cm/.node-gyp/16.11.1/deps/v8/include -I../../nan -I../src/libsass/include  -fPIC -pthread -Wall -Wextra -Wno-unused-parameter -m64 -O3 -fno-omit-frame-pointer -fno-rtti -fno-exceptions -std=gnu++14 -std=c++0x -MMD -MF ./Release/.deps/Release/obj.target/binding/src/binding.o.d.raw   -c -o Release/obj.target/binding/src/binding.o ../src/binding.cpp
1516 error make: 离开目录“/it/www/vue/node_modules/node-sass/build”
1517 error gyp info it worked if it ends with ok
1517 error gyp verb cli [
1517 error gyp verb cli   '/usr/bin/node',
1517 error gyp verb cli   '/it/www/vue/node_modules/node-gyp/bin/node-gyp.js',
1517 error gyp verb cli   'rebuild',
1517 error gyp verb cli   '--verbose',
1517 error gyp verb cli   '--libsass_ext=',
1517 error gyp verb cli   '--libsass_cflags=',
1517 error gyp verb cli   '--libsass_ldflags=',
1517 error gyp verb cli   '--libsass_library='
1517 error gyp verb cli ]
1517 error gyp info using node-gyp@3.8.0
1517 error gyp info using node@16.11.1 | linux | x64
1517 error gyp verb command rebuild []
1517 error gyp verb command clean []
1517 error gyp verb clean removing "build" directory
1517 error gyp verb command configure []
1517 error gyp verb check python checking for Python executable "python2" in the PATH
1517 error gyp verb `which` succeeded python2 /usr/bin/python2
1517 error gyp verb check python version `/usr/bin/python2 -c "import sys; print "2.7.18
1517 error gyp verb check python version .%s.%s" % sys.version_info[:3];"` returned: %j
1517 error gyp verb get node dir no --target version specified, falling back to host node version: 16.11.1
1517 error gyp verb command install [ '16.11.1' ]
1517 error gyp verb install input version string "16.11.1"
1517 error gyp verb install installing version: 16.11.1
1517 error gyp verb install --ensure was passed, so won't reinstall if already installed
1517 error gyp verb install version is already installed, need to check "installVersion"
1517 error gyp verb got "installVersion" 9
1517 error gyp verb needs "installVersion" 9
1517 error gyp verb install version is good
1517 error gyp verb get node dir target node version installed: 16.11.1
1517 error gyp verb build dir attempting to create "build" dir: /it/www/vue/node_modules/node-sass/build
1517 error gyp verb build dir "build" dir needed to be created? /it/www/vue/node_modules/node-sass/build
1517 error gyp verb build/config.gypi creating config file
1517 error gyp verb build/config.gypi writing out config file: /it/www/vue/node_modules/node-sass/build/config.gypi
1517 error (node:13135) [DEP0150] DeprecationWarning: Setting process.config is deprecated. In the future the property will be read-only.
1517 error (Use `node --trace-deprecation ...` to show where the warning was created)
1517 error gyp verb config.gypi checking for gypi file: /it/www/vue/node_modules/node-sass/config.gypi
1517 error gyp verb common.gypi checking for gypi file: /it/www/vue/node_modules/node-sass/common.gypi
1517 error gyp verb gyp gyp format was not specified; forcing "make"
1517 error gyp info spawn /usr/bin/python2
1517 error gyp info spawn args [
1517 error gyp info spawn args   '/it/www/vue/node_modules/node-gyp/gyp/gyp_main.py',
1517 error gyp info spawn args   'binding.gyp',
1517 error gyp info spawn args   '-f',
1517 error gyp info spawn args   'make',
1517 error gyp info spawn args   '-I',
1517 error gyp info spawn args   '/it/www/vue/node_modules/node-sass/build/config.gypi',
1517 error gyp info spawn args   '-I',
1517 error gyp info spawn args   '/it/www/vue/node_modules/node-gyp/addon.gypi',
1517 error gyp info spawn args   '-I',
1517 error gyp info spawn args   '/home/cm/.node-gyp/16.11.1/include/node/common.gypi',
1517 error gyp info spawn args   '-Dlibrary=shared_library',
1517 error gyp info spawn args   '-Dvisibility=default',
1517 error gyp info spawn args   '-Dnode_root_dir=/home/cm/.node-gyp/16.11.1',
1517 error gyp info spawn args   '-Dnode_gyp_dir=/it/www/vue/node_modules/node-gyp',
1517 error gyp info spawn args   '-Dnode_lib_file=/home/cm/.node-gyp/16.11.1/<(target_arch)/node.lib',
1517 error gyp info spawn args   '-Dmodule_root_dir=/it/www/vue/node_modules/node-sass',
1517 error gyp info spawn args   '-Dnode_engine=v8',
1517 error gyp info spawn args   '--depth=.',
1517 error gyp info spawn args   '--no-parallel',
1517 error gyp info spawn args   '--generator-output',
1517 error gyp info spawn args   'build',
1517 error gyp info spawn args   '-Goutput_dir=.'
1517 error gyp info spawn args ]
1517 error gyp verb command build []
1517 error gyp verb build type Release
1517 error gyp verb architecture x64
1517 error gyp verb node dev dir /home/cm/.node-gyp/16.11.1
1517 error gyp verb `which` succeeded for `make` /usr/bin/make
1517 error gyp info spawn make
1517 error gyp info spawn args [ 'V=1', 'BUILDTYPE=Release', '-C', 'build' ]
1517 error In file included from ../src/libsass/src/ast.cpp:2:
1517 error ../src/libsass/src/ast.hpp: 在成员函数‘virtual size_t Sass::Number::hash()’中:
1517 error ../src/libsass/src/ast.hpp:1614:25: 警告:loop variable ‘numerator’ creates a copy from type ‘const std::__cxx11::basic_string<char>’ [-Wrange-loop-construct]
1517 error  1614 |         for (const auto numerator : numerators)
1517 error       |                         ^~~~~~~~~
1517 error ../src/libsass/src/ast.hpp:1614:25: 附注:use reference type to prevent copying
1517 error  1614 |         for (const auto numerator : numerators)
1517 error       |                         ^~~~~~~~~
1517 error       |                         &
1517 error ../src/libsass/src/ast.hpp:1616:25: 警告:loop variable ‘denominator’ creates a copy from type ‘const std::__cxx11::basic_string<char>’ [-Wrange-loop-construct]
1517 error  1616 |         for (const auto denominator : denominators)
1517 error       |                         ^~~~~~~~~~~
1517 error ../src/libsass/src/ast.hpp:1616:25: 附注:use reference type to prevent copying
1517 error  1616 |         for (const auto denominator : denominators)
1517 error       |                         ^~~~~~~~~~~
1517 error       |                         &
1517 error In file included from ../src/libsass/src/ast_fwd_decl.cpp:1:
1517 error ../src/libsass/src/ast.hpp: 在成员函数‘virtual size_t Sass::Number::hash()’中:
1517 error ../src/libsass/src/ast.hpp:1614:25: 警告:loop variable ‘numerator’ creates a copy from type ‘const std::__cxx11::basic_string<char>’ [-Wrange-loop-construct]
1517 error  1614 |         for (const auto numerator : numerators)
1517 error       |                         ^~~~~~~~~
1517 error ../src/libsass/src/ast.hpp:1614:25: 附注:use reference type to prevent copying
1517 error  1614 |         for (const auto numerator : numerators)
1517 error       |                         ^~~~~~~~~
1517 error       |                         &
1517 error ../src/libsass/src/ast.hpp:1616:25: 警告:loop variable ‘denominator’ creates a copy from type ‘const std::__cxx11::basic_string<char>’ [-Wrange-loop-construct]
1517 error  1616 |         for (const auto denominator : denominators)
1517 error       |                         ^~~~~~~~~~~
1517 error ../src/libsass/src/ast.hpp:1616:25: 附注:use reference type to prevent copying
1517 error  1616 |         for (const auto denominator : denominators)
1517 error       |                         ^~~~~~~~~~~
1517 error       |                         &
1517 error In file included from ../src/libsass/src/bind.cpp:3:
1517 error ../src/libsass/src/ast.hpp: 在成员函数‘virtual size_t Sass::Number::hash()’中:
1517 error ../src/libsass/src/ast.hpp:1614:25: 警告:loop variable ‘numerator’ creates a copy from type ‘const std::__cxx11::basic_string<char>’ [-Wrange-loop-construct]
1517 error  1614 |         for (const auto numerator : numerators)
1517 error       |                         ^~~~~~~~~
1517 error ../src/libsass/src/ast.hpp:1614:25: 附注:use reference type to prevent copying
1517 error  1614 |         for (const auto numerator : numerators)
1517 error       |                         ^~~~~~~~~
1517 error       |                         &
1517 error ../src/libsass/src/ast.hpp:1616:25: 警告:loop variable ‘denominator’ creates a copy from type ‘const std::__cxx11::basic_string<char>’ [-Wrange-loop-construct]
1517 error  1616 |         for (const auto denominator : denominators)
1517 error       |                         ^~~~~~~~~~~
1517 error ../src/libsass/src/ast.hpp:1616:25: 附注:use reference type to prevent copying
1517 error  1616 |         for (const auto denominator : denominators)
1517 error       |                         ^~~~~~~~~~~
1517 error       |                         &
1517 error ../src/libsass/src/cencode.c: 在函数‘base64_encode_block’中:
1517 error ../src/libsass/src/cencode.c:48:32: 警告:this statement may fall through [-Wimplicit-fallthrough=]
1517 error    48 |                         result = (fragment & 0x003) << 4;
1517 error       |                         ~~~~~~~^~~~~~~~~~~~~~~~~~~~~~~~~
1517 error ../src/libsass/src/cencode.c:52:9: 附注:here
1517 error    52 |         case step_B:
1517 error       |         ^~~~
1517 error ../src/libsass/src/cencode.c:62:32: 警告:this statement may fall through [-Wimplicit-fallthrough=]
1517 error    62 |                         result = (fragment & 0x00f) << 2;
1517 error       |                         ~~~~~~~^~~~~~~~~~~~~~~~~~~~~~~~~
1517 error ../src/libsass/src/cencode.c:66:9: 附注:here
1517 error    66 |         case step_C:
1517 error       |         ^~~~
1517 error In file included from ../src/libsass/src/check_nesting.hpp:4,
1517 error                  from ../src/libsass/src/check_nesting.cpp:4:
1517 error ../src/libsass/src/ast.hpp: 在成员函数‘virtual size_t Sass::Number::hash()’中:
1517 error ../src/libsass/src/ast.hpp:1614:25: 警告:loop variable ‘numerator’ creates a copy from type ‘const std::__cxx11::basic_string<char>’ [-Wrange-loop-construct]
1517 error  1614 |         for (const auto numerator : numerators)
1517 error       |                         ^~~~~~~~~
1517 error ../src/libsass/src/ast.hpp:1614:25: 附注:use reference type to prevent copying
1517 error  1614 |         for (const auto numerator : numerators)
1517 error       |                         ^~~~~~~~~
1517 error       |                         &
1517 error ../src/libsass/src/ast.hpp:1616:25: 警告:loop variable ‘denominator’ creates a copy from type ‘const std::__cxx11::basic_string<char>’ [-Wrange-loop-construct]
1517 error  1616 |         for (const auto denominator : denominators)
1517 error       |                         ^~~~~~~~~~~
1517 error ../src/libsass/src/ast.hpp:1616:25: 附注:use reference type to prevent copying
1517 error  1616 |         for (const auto denominator : denominators)
1517 error       |                         ^~~~~~~~~~~
1517 error       |                         &
1517 error In file included from ../src/libsass/src/color_maps.cpp:2:
1517 error ../src/libsass/src/ast.hpp: 在成员函数‘virtual size_t Sass::Number::hash()’中:
1517 error ../src/libsass/src/ast.hpp:1614:25: 警告:loop variable ‘numerator’ creates a copy from type ‘const std::__cxx11::basic_string<char>’ [-Wrange-loop-construct]
1517 error  1614 |         for (const auto numerator : numerators)
1517 error       |                         ^~~~~~~~~
1517 error ../src/libsass/src/ast.hpp:1614:25: 附注:use reference type to prevent copying
1517 error  1614 |         for (const auto numerator : numerators)
1517 error       |                         ^~~~~~~~~
1517 error       |                         &
1517 error ../src/libsass/src/ast.hpp:1616:25: 警告:loop variable ‘denominator’ creates a copy from type ‘const std::__cxx11::basic_string<char>’ [-Wrange-loop-construct]
1517 error  1616 |         for (const auto denominator : denominators)
1517 error       |                         ^~~~~~~~~~~
1517 error ../src/libsass/src/ast.hpp:1616:25: 附注:use reference type to prevent copying
1517 error  1616 |         for (const auto denominator : denominators)
1517 error       |                         ^~~~~~~~~~~
1517 error       |                         &
1517 error In file included from ../src/libsass/src/context.cpp:9:
1517 error ../src/libsass/src/ast.hpp: 在成员函数‘virtual size_t Sass::Number::hash()’中:
1517 error ../src/libsass/src/ast.hpp:1614:25: 警告:loop variable ‘numerator’ creates a copy from type ‘const std::__cxx11::basic_string<char>’ [-Wrange-loop-construct]
1517 error  1614 |         for (const auto numerator : numerators)
1517 error       |                         ^~~~~~~~~
1517 error ../src/libsass/src/ast.hpp:1614:25: 附注:use reference type to prevent copying
1517 error  1614 |         for (const auto numerator : numerators)
1517 error       |                         ^~~~~~~~~
1517 error       |                         &
1517 error ../src/libsass/src/ast.hpp:1616:25: 警告:loop variable ‘denominator’ creates a copy from type ‘const std::__cxx11::basic_string<char>’ [-Wrange-loop-construct]
1517 error  1616 |         for (const auto denominator : denominators)
1517 error       |                         ^~~~~~~~~~~
1517 error ../src/libsass/src/ast.hpp:1616:25: 附注:use reference type to prevent copying
1517 error  1616 |         for (const auto denominator : denominators)
1517 error       |                         ^~~~~~~~~~~
1517 error       |                         &
1517 error In file included from ../src/libsass/src/cssize.hpp:4,
1517 error                  from ../src/libsass/src/cssize.cpp:6:
1517 error ../src/libsass/src/ast.hpp: 在成员函数‘virtual size_t Sass::Number::hash()’中:
1517 error ../src/libsass/src/ast.hpp:1614:25: 警告:loop variable ‘numerator’ creates a copy from type ‘const std::__cxx11::basic_string<char>’ [-Wrange-loop-construct]
1517 error  1614 |         for (const auto numerator : numerators)
1517 error       |                         ^~~~~~~~~
1517 error ../src/libsass/src/ast.hpp:1614:25: 附注:use reference type to prevent copying
1517 error  1614 |         for (const auto numerator : numerators)
1517 error       |                         ^~~~~~~~~
1517 error       |                         &
1517 error ../src/libsass/src/ast.hpp:1616:25: 警告:loop variable ‘denominator’ creates a copy from type ‘const std::__cxx11::basic_string<char>’ [-Wrange-loop-construct]
1517 error  1616 |         for (const auto denominator : denominators)
1517 error       |                         ^~~~~~~~~~~
1517 error ../src/libsass/src/ast.hpp:1616:25: 附注:use reference type to prevent copying
1517 error  1616 |         for (const auto denominator : denominators)
1517 error       |                         ^~~~~~~~~~~
1517 error       |                         &
1517 error In file included from ../src/libsass/src/environment.cpp:2:
1517 error ../src/libsass/src/ast.hpp: 在成员函数‘virtual size_t Sass::Number::hash()’中:
1517 error ../src/libsass/src/ast.hpp:1614:25: 警告:loop variable ‘numerator’ creates a copy from type ‘const std::__cxx11::basic_string<char>’ [-Wrange-loop-construct]
1517 error  1614 |         for (const auto numerator : numerators)
1517 error       |                         ^~~~~~~~~
1517 error ../src/libsass/src/ast.hpp:1614:25: 附注:use reference type to prevent copying
1517 error  1614 |         for (const auto numerator : numerators)
1517 error       |                         ^~~~~~~~~
1517 error       |                         &
1517 error ../src/libsass/src/ast.hpp:1616:25: 警告:loop variable ‘denominator’ creates a copy from type ‘const std::__cxx11::basic_string<char>’ [-Wrange-loop-construct]
1517 error  1616 |         for (const auto denominator : denominators)
1517 error       |                         ^~~~~~~~~~~
1517 error ../src/libsass/src/ast.hpp:1616:25: 附注:use reference type to prevent copying
1517 error  1616 |         for (const auto denominator : denominators)
1517 error       |                         ^~~~~~~~~~~
1517 error       |                         &
1517 error In file included from ../src/libsass/src/error_handling.cpp:2:
1517 error ../src/libsass/src/ast.hpp: 在成员函数‘virtual size_t Sass::Number::hash()’中:
1517 error ../src/libsass/src/ast.hpp:1614:25: 警告:loop variable ‘numerator’ creates a copy from type ‘const std::__cxx11::basic_string<char>’ [-Wrange-loop-construct]
1517 error  1614 |         for (const auto numerator : numerators)
1517 error       |                         ^~~~~~~~~
1517 error ../src/libsass/src/ast.hpp:1614:25: 附注:use reference type to prevent copying
1517 error  1614 |         for (const auto numerator : numerators)
1517 error       |                         ^~~~~~~~~
1517 error       |                         &
1517 error ../src/libsass/src/ast.hpp:1616:25: 警告:loop variable ‘denominator’ creates a copy from type ‘const std::__cxx11::basic_string<char>’ [-Wrange-loop-construct]
1517 error  1616 |         for (const auto denominator : denominators)
1517 error       |                         ^~~~~~~~~~~
1517 error ../src/libsass/src/ast.hpp:1616:25: 附注:use reference type to prevent copying
1517 error  1616 |         for (const auto denominator : denominators)
1517 error       |                         ^~~~~~~~~~~
1517 error       |                         &
1517 error In file included from ../src/libsass/src/eval.hpp:4,
1517 error                  from ../src/libsass/src/eval.cpp:10:
1517 error ../src/libsass/src/ast.hpp: 在成员函数‘virtual size_t Sass::Number::hash()’中:
1517 error ../src/libsass/src/ast.hpp:1614:25: 警告:loop variable ‘numerator’ creates a copy from type ‘const std::__cxx11::basic_string<char>’ [-Wrange-loop-construct]
1517 error  1614 |         for (const auto numerator : numerators)
1517 error       |                         ^~~~~~~~~
1517 error ../src/libsass/src/ast.hpp:1614:25: 附注:use reference type to prevent copying
1517 error  1614 |         for (const auto numerator : numerators)
1517 error       |                         ^~~~~~~~~
1517 error       |                         &
1517 error ../src/libsass/src/ast.hpp:1616:25: 警告:loop variable ‘denominator’ creates a copy from type ‘const std::__cxx11::basic_string<char>’ [-Wrange-loop-construct]
1517 error  1616 |         for (const auto denominator : denominators)
1517 error       |                         ^~~~~~~~~~~
1517 error ../src/libsass/src/ast.hpp:1616:25: 附注:use reference type to prevent copying
1517 error  1616 |         for (const auto denominator : denominators)
1517 error       |                         ^~~~~~~~~~~
1517 error       |                         &
1517 error In file included from ../src/libsass/src/expand.cpp:5:
1517 error ../src/libsass/src/ast.hpp: 在成员函数‘virtual size_t Sass::Number::hash()’中:
1517 error ../src/libsass/src/ast.hpp:1614:25: 警告:loop variable ‘numerator’ creates a copy from type ‘const std::__cxx11::basic_string<char>’ [-Wrange-loop-construct]
1517 error  1614 |         for (const auto numerator : numerators)
1517 error       |                         ^~~~~~~~~
1517 error ../src/libsass/src/ast.hpp:1614:25: 附注:use reference type to prevent copying
1517 error  1614 |         for (const auto numerator : numerators)
1517 error       |                         ^~~~~~~~~
1517 error       |                         &
1517 error ../src/libsass/src/ast.hpp:1616:25: 警告:loop variable ‘denominator’ creates a copy from type ‘const std::__cxx11::basic_string<char>’ [-Wrange-loop-construct]
1517 error  1616 |         for (const auto denominator : denominators)
1517 error       |                         ^~~~~~~~~~~
1517 error ../src/libsass/src/ast.hpp:1616:25: 附注:use reference type to prevent copying
1517 error  1616 |         for (const auto denominator : denominators)
1517 error       |                         ^~~~~~~~~~~
1517 error       |                         &
1517 error In file included from ../src/libsass/src/extend.hpp:7,
1517 error                  from ../src/libsass/src/extend.cpp:2:
1517 error ../src/libsass/src/ast.hpp: 在成员函数‘virtual size_t Sass::Number::hash()’中:
1517 error ../src/libsass/src/ast.hpp:1614:25: 警告:loop variable ‘numerator’ creates a copy from type ‘const std::__cxx11::basic_string<char>’ [-Wrange-loop-construct]
1517 error  1614 |         for (const auto numerator : numerators)
1517 error       |                         ^~~~~~~~~
1517 error ../src/libsass/src/ast.hpp:1614:25: 附注:use reference type to prevent copying
1517 error  1614 |         for (const auto numerator : numerators)
1517 error       |                         ^~~~~~~~~
1517 error       |                         &
1517 error ../src/libsass/src/ast.hpp:1616:25: 警告:loop variable ‘denominator’ creates a copy from type ‘const std::__cxx11::basic_string<char>’ [-Wrange-loop-construct]
1517 error  1616 |         for (const auto denominator : denominators)
1517 error       |                         ^~~~~~~~~~~
1517 error ../src/libsass/src/ast.hpp:1616:25: 附注:use reference type to prevent copying
1517 error  1616 |         for (const auto denominator : denominators)
1517 error       |                         ^~~~~~~~~~~
1517 error       |                         &
1517 error In file included from ../src/libsass/src/listize.hpp:7,
1517 error                  from ../src/libsass/src/functions.hpp:4,
1517 error                  from ../src/libsass/src/sass_functions.hpp:6,
1517 error                  from ../src/libsass/src/file.cpp:23:
1517 error ../src/libsass/src/ast.hpp: 在成员函数‘virtual size_t Sass::Number::hash()’中:
1517 error ../src/libsass/src/ast.hpp:1614:25: 警告:loop variable ‘numerator’ creates a copy from type ‘const std::__cxx11::basic_string<char>’ [-Wrange-loop-construct]
1517 error  1614 |         for (const auto numerator : numerators)
1517 error       |                         ^~~~~~~~~
1517 error ../src/libsass/src/ast.hpp:1614:25: 附注:use reference type to prevent copying
1517 error  1614 |         for (const auto numerator : numerators)
1517 error       |                         ^~~~~~~~~
1517 error       |                         &
1517 error ../src/libsass/src/ast.hpp:1616:25: 警告:loop variable ‘denominator’ creates a copy from type ‘const std::__cxx11::basic_string<char>’ [-Wrange-loop-construct]
1517 error  1616 |         for (const auto denominator : denominators)
1517 error       |                         ^~~~~~~~~~~
1517 error ../src/libsass/src/ast.hpp:1616:25: 附注:use reference type to prevent copying
1517 error  1616 |         for (const auto denominator : denominators)
1517 error       |                         ^~~~~~~~~~~
1517 error       |                         &
1517 error In file included from ../src/libsass/src/listize.hpp:7,
1517 error                  from ../src/libsass/src/functions.hpp:4,
1517 error                  from ../src/libsass/src/functions.cpp:2:
1517 error ../src/libsass/src/ast.hpp: 在成员函数‘virtual size_t Sass::Number::hash()’中:
1517 error ../src/libsass/src/ast.hpp:1614:25: 警告:loop variable ‘numerator’ creates a copy from type ‘const std::__cxx11::basic_string<char>’ [-Wrange-loop-construct]
1517 error  1614 |         for (const auto numerator : numerators)
1517 error       |                         ^~~~~~~~~
1517 error ../src/libsass/src/ast.hpp:1614:25: 附注:use reference type to prevent copying
1517 error  1614 |         for (const auto numerator : numerators)
1517 error       |                         ^~~~~~~~~
1517 error       |                         &
1517 error ../src/libsass/src/ast.hpp:1616:25: 警告:loop variable ‘denominator’ creates a copy from type ‘const std::__cxx11::basic_string<char>’ [-Wrange-loop-construct]
1517 error  1616 |         for (const auto denominator : denominators)
1517 error       |                         ^~~~~~~~~~~
1517 error ../src/libsass/src/ast.hpp:1616:25: 附注:use reference type to prevent copying
1517 error  1616 |         for (const auto denominator : denominators)
1517 error       |                         ^~~~~~~~~~~
1517 error       |                         &
1517 error ../src/libsass/src/functions.cpp: 在函数‘void Sass::Functions::handle_utf8_error(const Sass::ParserState&, Sass::Backtraces)’中:
1517 error ../src/libsass/src/functions.cpp:110:20: 警告:catching polymorphic type ‘class utf8::invalid_code_point’ by value [-Wcatch-value=]
1517 error   110 |       catch (utf8::invalid_code_point) {
1517 error       |                    ^~~~~~~~~~~~~~~~~~
1517 error ../src/libsass/src/functions.cpp:114:20: 警告:catching polymorphic type ‘class utf8::not_enough_room’ by value [-Wcatch-value=]
1517 error   114 |       catch (utf8::not_enough_room) {
1517 error       |                    ^~~~~~~~~~~~~~~
1517 error ../src/libsass/src/functions.cpp:118:20: 警告:catching polymorphic type ‘class utf8::invalid_utf8’ by value [-Wcatch-value=]
1517 error   118 |       catch (utf8::invalid_utf8) {
1517 error       |                    ^~~~~~~~~~~~
1517 error In file included from ../src/libsass/src/inspect.cpp:9:
1517 error ../src/libsass/src/ast.hpp: 在成员函数‘virtual size_t Sass::Number::hash()’中:
1517 error ../src/libsass/src/ast.hpp:1614:25: 警告:loop variable ‘numerator’ creates a copy from type ‘const std::__cxx11::basic_string<char>’ [-Wrange-loop-construct]
1517 error  1614 |         for (const auto numerator : numerators)
1517 error       |                         ^~~~~~~~~
1517 error ../src/libsass/src/ast.hpp:1614:25: 附注:use reference type to prevent copying
1517 error  1614 |         for (const auto numerator : numerators)
1517 error       |                         ^~~~~~~~~
1517 error       |                         &
1517 error ../src/libsass/src/ast.hpp:1616:25: 警告:loop variable ‘denominator’ creates a copy from type ‘const std::__cxx11::basic_string<char>’ [-Wrange-loop-construct]
1517 error  1616 |         for (const auto denominator : denominators)
1517 error       |                         ^~~~~~~~~~~
1517 error ../src/libsass/src/ast.hpp:1616:25: 附注:use reference type to prevent copying
1517 error  1616 |         for (const auto denominator : denominators)
1517 error       |                         ^~~~~~~~~~~
1517 error       |                         &
1517 error ../src/libsass/src/json.cpp: 在函数‘char* json_encode_string(const char*)’中:
1517 error ../src/libsass/src/json.cpp:405:15: 警告:catching polymorphic type ‘class std::exception’ by value [-Wcatch-value=]
1517 error   405 |   catch (std::exception) {
1517 error       |               ^~~~~~~~~
1517 error ../src/libsass/src/json.cpp: 在函数‘char* json_stringify(const JsonNode*, const char*)’中:
1517 error ../src/libsass/src/json.cpp:424:15: 警告:catching polymorphic type ‘class std::exception’ by value [-Wcatch-value=]
1517 error   424 |   catch (std::exception) {
1517 error       |               ^~~~~~~~~
1517 error In file included from ../src/libsass/src/listize.hpp:7,
1517 error                  from ../src/libsass/src/listize.cpp:6:
1517 error ../src/libsass/src/ast.hpp: 在成员函数‘virtual size_t Sass::Number::hash()’中:
1517 error ../src/libsass/src/ast.hpp:1614:25: 警告:loop variable ‘numerator’ creates a copy from type ‘const std::__cxx11::basic_string<char>’ [-Wrange-loop-construct]
1517 error  1614 |         for (const auto numerator : numerators)
1517 error       |                         ^~~~~~~~~
1517 error ../src/libsass/src/ast.hpp:1614:25: 附注:use reference type to prevent copying
1517 error  1614 |         for (const auto numerator : numerators)
1517 error       |                         ^~~~~~~~~
1517 error       |                         &
1517 error ../src/libsass/src/ast.hpp:1616:25: 警告:loop variable ‘denominator’ creates a copy from type ‘const std::__cxx11::basic_string<char>’ [-Wrange-loop-construct]
1517 error  1616 |         for (const auto denominator : denominators)
1517 error       |                         ^~~~~~~~~~~
1517 error ../src/libsass/src/ast.hpp:1616:25: 附注:use reference type to prevent copying
1517 error  1616 |         for (const auto denominator : denominators)
1517 error       |                         ^~~~~~~~~~~
1517 error       |                         &
1517 error In file included from ../src/libsass/src/node.hpp:7,
1517 error                  from ../src/libsass/src/node.cpp:4:
1517 error ../src/libsass/src/ast.hpp: 在成员函数‘virtual size_t Sass::Number::hash()’中:
1517 error ../src/libsass/src/ast.hpp:1614:25: 警告:loop variable ‘numerator’ creates a copy from type ‘const std::__cxx11::basic_string<char>’ [-Wrange-loop-construct]
1517 error  1614 |         for (const auto numerator : numerators)
1517 error       |                         ^~~~~~~~~
1517 error ../src/libsass/src/ast.hpp:1614:25: 附注:use reference type to prevent copying
1517 error  1614 |         for (const auto numerator : numerators)
1517 error       |                         ^~~~~~~~~
1517 error       |                         &
1517 error ../src/libsass/src/ast.hpp:1616:25: 警告:loop variable ‘denominator’ creates a copy from type ‘const std::__cxx11::basic_string<char>’ [-Wrange-loop-construct]
1517 error  1616 |         for (const auto denominator : denominators)
1517 error       |                         ^~~~~~~~~~~
1517 error ../src/libsass/src/ast.hpp:1616:25: 附注:use reference type to prevent copying
1517 error  1616 |         for (const auto denominator : denominators)
1517 error       |                         ^~~~~~~~~~~
1517 error       |                         &
1517 error In file included from ../src/libsass/src/values.hpp:4,
1517 error                  from ../src/libsass/src/operators.hpp:4,
1517 error                  from ../src/libsass/src/operators.cpp:2:
1517 error ../src/libsass/src/ast.hpp: 在成员函数‘virtual size_t Sass::Number::hash()’中:
1517 error ../src/libsass/src/ast.hpp:1614:25: 警告:loop variable ‘numerator’ creates a copy from type ‘const std::__cxx11::basic_string<char>’ [-Wrange-loop-construct]
1517 error  1614 |         for (const auto numerator : numerators)
1517 error       |                         ^~~~~~~~~
1517 error ../src/libsass/src/ast.hpp:1614:25: 附注:use reference type to prevent copying
1517 error  1614 |         for (const auto numerator : numerators)
1517 error       |                         ^~~~~~~~~
1517 error       |                         &
1517 error ../src/libsass/src/ast.hpp:1616:25: 警告:loop variable ‘denominator’ creates a copy from type ‘const std::__cxx11::basic_string<char>’ [-Wrange-loop-construct]
1517 error  1616 |         for (const auto denominator : denominators)
1517 error       |                         ^~~~~~~~~~~
1517 error ../src/libsass/src/ast.hpp:1616:25: 附注:use reference type to prevent copying
1517 error  1616 |         for (const auto denominator : denominators)
1517 error       |                         ^~~~~~~~~~~
1517 error       |                         &
1517 error In file included from ../src/libsass/src/output.cpp:2:
1517 error ../src/libsass/src/ast.hpp: 在成员函数‘virtual size_t Sass::Number::hash()’中:
1517 error ../src/libsass/src/ast.hpp:1614:25: 警告:loop variable ‘numerator’ creates a copy from type ‘const std::__cxx11::basic_string<char>’ [-Wrange-loop-construct]
1517 error  1614 |         for (const auto numerator : numerators)
1517 error       |                         ^~~~~~~~~
1517 error ../src/libsass/src/ast.hpp:1614:25: 附注:use reference type to prevent copying
1517 error  1614 |         for (const auto numerator : numerators)
1517 error       |                         ^~~~~~~~~
1517 error       |                         &
1517 error ../src/libsass/src/ast.hpp:1616:25: 警告:loop variable ‘denominator’ creates a copy from type ‘const std::__cxx11::basic_string<char>’ [-Wrange-loop-construct]
1517 error  1616 |         for (const auto denominator : denominators)
1517 error       |                         ^~~~~~~~~~~
1517 error ../src/libsass/src/ast.hpp:1616:25: 附注:use reference type to prevent copying
1517 error  1616 |         for (const auto denominator : denominators)
1517 error       |                         ^~~~~~~~~~~
1517 error       |                         &
1517 error In file included from ../src/libsass/src/parser.hpp:7,
1517 error                  from ../src/libsass/src/parser.cpp:2:
1517 error ../src/libsass/src/ast.hpp: 在成员函数‘virtual size_t Sass::Number::hash()’中:
1517 error ../src/libsass/src/ast.hpp:1614:25: 警告:loop variable ‘numerator’ creates a copy from type ‘const std::__cxx11::basic_string<char>’ [-Wrange-loop-construct]
1517 error  1614 |         for (const auto numerator : numerators)
1517 error       |                         ^~~~~~~~~
1517 error ../src/libsass/src/ast.hpp:1614:25: 附注:use reference type to prevent copying
1517 error  1614 |         for (const auto numerator : numerators)
1517 error       |                         ^~~~~~~~~
1517 error       |                         &
1517 error ../src/libsass/src/ast.hpp:1616:25: 警告:loop variable ‘denominator’ creates a copy from type ‘const std::__cxx11::basic_string<char>’ [-Wrange-loop-construct]
1517 error  1616 |         for (const auto denominator : denominators)
1517 error       |                         ^~~~~~~~~~~
1517 error ../src/libsass/src/ast.hpp:1616:25: 附注:use reference type to prevent copying
1517 error  1616 |         for (const auto denominator : denominators)
1517 error       |                         ^~~~~~~~~~~
1517 error       |                         &
1517 error In file included from ../src/libsass/src/remove_placeholders.hpp:6,
1517 error                  from ../src/libsass/src/remove_placeholders.cpp:2:
1517 error ../src/libsass/src/ast.hpp: 在成员函数‘virtual size_t Sass::Number::hash()’中:
1517 error ../src/libsass/src/ast.hpp:1614:25: 警告:loop variable ‘numerator’ creates a copy from type ‘const std::__cxx11::basic_string<char>’ [-Wrange-loop-construct]
1517 error  1614 |         for (const auto numerator : numerators)
1517 error       |                         ^~~~~~~~~
1517 error ../src/libsass/src/ast.hpp:1614:25: 附注:use reference type to prevent copying
1517 error  1614 |         for (const auto numerator : numerators)
1517 error       |                         ^~~~~~~~~
1517 error       |                         &
1517 error ../src/libsass/src/ast.hpp:1616:25: 警告:loop variable ‘denominator’ creates a copy from type ‘const std::__cxx11::basic_string<char>’ [-Wrange-loop-construct]
1517 error  1616 |         for (const auto denominator : denominators)
1517 error       |                         ^~~~~~~~~~~
1517 error ../src/libsass/src/ast.hpp:1616:25: 附注:use reference type to prevent copying
1517 error  1616 |         for (const auto denominator : denominators)
1517 error       |                         ^~~~~~~~~~~
1517 error       |                         &
1517 error In file included from ../src/libsass/src/listize.hpp:7,
1517 error                  from ../src/libsass/src/functions.hpp:4,
1517 error                  from ../src/libsass/src/sass_functions.hpp:6,
1517 error                  from ../src/libsass/src/sass.cpp:11:
1517 error ../src/libsass/src/ast.hpp: 在成员函数‘virtual size_t Sass::Number::hash()’中:
1517 error ../src/libsass/src/ast.hpp:1614:25: 警告:loop variable ‘numerator’ creates a copy from type ‘const std::__cxx11::basic_string<char>’ [-Wrange-loop-construct]
1517 error  1614 |         for (const auto numerator : numerators)
1517 error       |                         ^~~~~~~~~
1517 error ../src/libsass/src/ast.hpp:1614:25: 附注:use reference type to prevent copying
1517 error  1614 |         for (const auto numerator : numerators)
1517 error       |                         ^~~~~~~~~
1517 error       |                         &
1517 error ../src/libsass/src/ast.hpp:1616:25: 警告:loop variable ‘denominator’ creates a copy from type ‘const std::__cxx11::basic_string<char>’ [-Wrange-loop-construct]
1517 error  1616 |         for (const auto denominator : denominators)
1517 error       |                         ^~~~~~~~~~~
1517 error ../src/libsass/src/ast.hpp:1616:25: 附注:use reference type to prevent copying
1517 error  1616 |         for (const auto denominator : denominators)
1517 error       |                         ^~~~~~~~~~~
1517 error       |                         &
1517 error In file included from ../src/libsass/src/sass_context.cpp:9:
1517 error ../src/libsass/src/ast.hpp: 在成员函数‘virtual size_t Sass::Number::hash()’中:
1517 error ../src/libsass/src/ast.hpp:1614:25: 警告:loop variable ‘numerator’ creates a copy from type ‘const std::__cxx11::basic_string<char>’ [-Wrange-loop-construct]
1517 error  1614 |         for (const auto numerator : numerators)
1517 error       |                         ^~~~~~~~~
1517 error ../src/libsass/src/ast.hpp:1614:25: 附注:use reference type to prevent copying
1517 error  1614 |         for (const auto numerator : numerators)
1517 error       |                         ^~~~~~~~~
1517 error       |                         &
1517 error ../src/libsass/src/ast.hpp:1616:25: 警告:loop variable ‘denominator’ creates a copy from type ‘const std::__cxx11::basic_string<char>’ [-Wrange-loop-construct]
1517 error  1616 |         for (const auto denominator : denominators)
1517 error       |                         ^~~~~~~~~~~
1517 error ../src/libsass/src/ast.hpp:1616:25: 附注:use reference type to prevent copying
1517 error  1616 |         for (const auto denominator : denominators)
1517 error       |                         ^~~~~~~~~~~
1517 error       |                         &
1517 error In file included from ../src/libsass/src/values.hpp:4,
1517 error                  from ../src/libsass/src/sass_functions.cpp:5:
1517 error ../src/libsass/src/ast.hpp: 在成员函数‘virtual size_t Sass::Number::hash()’中:
1517 error ../src/libsass/src/ast.hpp:1614:25: 警告:loop variable ‘numerator’ creates a copy from type ‘const std::__cxx11::basic_string<char>’ [-Wrange-loop-construct]
1517 error  1614 |         for (const auto numerator : numerators)
1517 error       |                         ^~~~~~~~~
1517 error ../src/libsass/src/ast.hpp:1614:25: 附注:use reference type to prevent copying
1517 error  1614 |         for (const auto numerator : numerators)
1517 error       |                         ^~~~~~~~~
1517 error       |                         &
1517 error ../src/libsass/src/ast.hpp:1616:25: 警告:loop variable ‘denominator’ creates a copy from type ‘const std::__cxx11::basic_string<char>’ [-Wrange-loop-construct]
1517 error  1616 |         for (const auto denominator : denominators)
1517 error       |                         ^~~~~~~~~~~
1517 error ../src/libsass/src/ast.hpp:1616:25: 附注:use reference type to prevent copying
1517 error  1616 |         for (const auto denominator : denominators)
1517 error       |                         ^~~~~~~~~~~
1517 error       |                         &
1517 error In file included from ../src/libsass/src/node.hpp:7,
1517 error                  from ../src/libsass/src/sass_util.cpp:2:
1517 error ../src/libsass/src/ast.hpp: 在成员函数‘virtual size_t Sass::Number::hash()’中:
1517 error ../src/libsass/src/ast.hpp:1614:25: 警告:loop variable ‘numerator’ creates a copy from type ‘const std::__cxx11::basic_string<char>’ [-Wrange-loop-construct]
1517 error  1614 |         for (const auto numerator : numerators)
1517 error       |                         ^~~~~~~~~
1517 error ../src/libsass/src/ast.hpp:1614:25: 附注:use reference type to prevent copying
1517 error  1614 |         for (const auto numerator : numerators)
1517 error       |                         ^~~~~~~~~
1517 error       |                         &
1517 error ../src/libsass/src/ast.hpp:1616:25: 警告:loop variable ‘denominator’ creates a copy from type ‘const std::__cxx11::basic_string<char>’ [-Wrange-loop-construct]
1517 error  1616 |         for (const auto denominator : denominators)
1517 error       |                         ^~~~~~~~~~~
1517 error ../src/libsass/src/ast.hpp:1616:25: 附注:use reference type to prevent copying
1517 error  1616 |         for (const auto denominator : denominators)
1517 error       |                         ^~~~~~~~~~~
1517 error       |                         &
1517 error In file included from ../src/libsass/src/eval.hpp:4,
1517 error                  from ../src/libsass/src/sass_values.cpp:5:
1517 error ../src/libsass/src/ast.hpp: 在成员函数‘virtual size_t Sass::Number::hash()’中:
1517 error ../src/libsass/src/ast.hpp:1614:25: 警告:loop variable ‘numerator’ creates a copy from type ‘const std::__cxx11::basic_string<char>’ [-Wrange-loop-construct]
1517 error  1614 |         for (const auto numerator : numerators)
1517 error       |                         ^~~~~~~~~
1517 error ../src/libsass/src/ast.hpp:1614:25: 附注:use reference type to prevent copying
1517 error  1614 |         for (const auto numerator : numerators)
1517 error       |                         ^~~~~~~~~
1517 error       |                         &
1517 error ../src/libsass/src/ast.hpp:1616:25: 警告:loop variable ‘denominator’ creates a copy from type ‘const std::__cxx11::basic_string<char>’ [-Wrange-loop-construct]
1517 error  1616 |         for (const auto denominator : denominators)
1517 error       |                         ^~~~~~~~~~~
1517 error ../src/libsass/src/ast.hpp:1616:25: 附注:use reference type to prevent copying
1517 error  1616 |         for (const auto denominator : denominators)
1517 error       |                         ^~~~~~~~~~~
1517 error       |                         &
1517 error In file included from ../src/libsass/src/source_map.cpp:7:
1517 error ../src/libsass/src/ast.hpp: 在成员函数‘virtual size_t Sass::Number::hash()’中:
1517 error ../src/libsass/src/ast.hpp:1614:25: 警告:loop variable ‘numerator’ creates a copy from type ‘const std::__cxx11::basic_string<char>’ [-Wrange-loop-construct]
1517 error  1614 |         for (const auto numerator : numerators)
1517 error       |                         ^~~~~~~~~
1517 error ../src/libsass/src/ast.hpp:1614:25: 附注:use reference type to prevent copying
1517 error  1614 |         for (const auto numerator : numerators)
1517 error       |                         ^~~~~~~~~
1517 error       |                         &
1517 error ../src/libsass/src/ast.hpp:1616:25: 警告:loop variable ‘denominator’ creates a copy from type ‘const std::__cxx11::basic_string<char>’ [-Wrange-loop-construct]
1517 error  1616 |         for (const auto denominator : denominators)
1517 error       |                         ^~~~~~~~~~~
1517 error ../src/libsass/src/ast.hpp:1616:25: 附注:use reference type to prevent copying
1517 error  1616 |         for (const auto denominator : denominators)
1517 error       |                         ^~~~~~~~~~~
1517 error       |                         &
1517 error In file included from ../src/libsass/src/subset_map.cpp:2:
1517 error ../src/libsass/src/ast.hpp: 在成员函数‘virtual size_t Sass::Number::hash()’中:
1517 error ../src/libsass/src/ast.hpp:1614:25: 警告:loop variable ‘numerator’ creates a copy from type ‘const std::__cxx11::basic_string<char>’ [-Wrange-loop-construct]
1517 error  1614 |         for (const auto numerator : numerators)
1517 error       |                         ^~~~~~~~~
1517 error ../src/libsass/src/ast.hpp:1614:25: 附注:use reference type to prevent copying
1517 error  1614 |         for (const auto numerator : numerators)
1517 error       |                         ^~~~~~~~~
1517 error       |                         &
1517 error ../src/libsass/src/ast.hpp:1616:25: 警告:loop variable ‘denominator’ creates a copy from type ‘const std::__cxx11::basic_string<char>’ [-Wrange-loop-construct]
1517 error  1616 |         for (const auto denominator : denominators)
1517 error       |                         ^~~~~~~~~~~
1517 error ../src/libsass/src/ast.hpp:1616:25: 附注:use reference type to prevent copying
1517 error  1616 |         for (const auto denominator : denominators)
1517 error       |                         ^~~~~~~~~~~
1517 error       |                         &
1517 error In file included from ../src/libsass/src/to_c.cpp:3:
1517 error ../src/libsass/src/ast.hpp: 在成员函数‘virtual size_t Sass::Number::hash()’中:
1517 error ../src/libsass/src/ast.hpp:1614:25: 警告:loop variable ‘numerator’ creates a copy from type ‘const std::__cxx11::basic_string<char>’ [-Wrange-loop-construct]
1517 error  1614 |         for (const auto numerator : numerators)
1517 error       |                         ^~~~~~~~~
1517 error ../src/libsass/src/ast.hpp:1614:25: 附注:use reference type to prevent copying
1517 error  1614 |         for (const auto numerator : numerators)
1517 error       |                         ^~~~~~~~~
1517 error       |                         &
1517 error ../src/libsass/src/ast.hpp:1616:25: 警告:loop variable ‘denominator’ creates a copy from type ‘const std::__cxx11::basic_string<char>’ [-Wrange-loop-construct]
1517 error  1616 |         for (const auto denominator : denominators)
1517 error       |                         ^~~~~~~~~~~
1517 error ../src/libsass/src/ast.hpp:1616:25: 附注:use reference type to prevent copying
1517 error  1616 |         for (const auto denominator : denominators)
1517 error       |                         ^~~~~~~~~~~
1517 error       |                         &
1517 error In file included from ../src/libsass/src/to_value.cpp:2:
1517 error ../src/libsass/src/ast.hpp: 在成员函数‘virtual size_t Sass::Number::hash()’中:
1517 error ../src/libsass/src/ast.hpp:1614:25: 警告:loop variable ‘numerator’ creates a copy from type ‘const std::__cxx11::basic_string<char>’ [-Wrange-loop-construct]
1517 error  1614 |         for (const auto numerator : numerators)
1517 error       |                         ^~~~~~~~~
1517 error ../src/libsass/src/ast.hpp:1614:25: 附注:use reference type to prevent copying
1517 error  1614 |         for (const auto numerator : numerators)
1517 error       |                         ^~~~~~~~~
1517 error       |                         &
1517 error ../src/libsass/src/ast.hpp:1616:25: 警告:loop variable ‘denominator’ creates a copy from type ‘const std::__cxx11::basic_string<char>’ [-Wrange-loop-construct]
1517 error  1616 |         for (const auto denominator : denominators)
1517 error       |                         ^~~~~~~~~~~
1517 error ../src/libsass/src/ast.hpp:1616:25: 附注:use reference type to prevent copying
1517 error  1616 |         for (const auto denominator : denominators)
1517 error       |                         ^~~~~~~~~~~
1517 error       |                         &
1517 error In file included from ../src/libsass/src/util.cpp:3:
1517 error ../src/libsass/src/ast.hpp: 在成员函数‘virtual size_t Sass::Number::hash()’中:
1517 error ../src/libsass/src/ast.hpp:1614:25: 警告:loop variable ‘numerator’ creates a copy from type ‘const std::__cxx11::basic_string<char>’ [-Wrange-loop-construct]
1517 error  1614 |         for (const auto numerator : numerators)
1517 error       |                         ^~~~~~~~~
1517 error ../src/libsass/src/ast.hpp:1614:25: 附注:use reference type to prevent copying
1517 error  1614 |         for (const auto numerator : numerators)
1517 error       |                         ^~~~~~~~~
1517 error       |                         &
1517 error ../src/libsass/src/ast.hpp:1616:25: 警告:loop variable ‘denominator’ creates a copy from type ‘const std::__cxx11::basic_string<char>’ [-Wrange-loop-construct]
1517 error  1616 |         for (const auto denominator : denominators)
1517 error       |                         ^~~~~~~~~~~
1517 error ../src/libsass/src/ast.hpp:1616:25: 附注:use reference type to prevent copying
1517 error  1616 |         for (const auto denominator : denominators)
1517 error       |                         ^~~~~~~~~~~
1517 error       |                         &
1517 error In file included from ../src/libsass/src/values.hpp:4,
1517 error                  from ../src/libsass/src/values.cpp:3:
1517 error ../src/libsass/src/ast.hpp: 在成员函数‘virtual size_t Sass::Number::hash()’中:
1517 error ../src/libsass/src/ast.hpp:1614:25: 警告:loop variable ‘numerator’ creates a copy from type ‘const std::__cxx11::basic_string<char>’ [-Wrange-loop-construct]
1517 error  1614 |         for (const auto numerator : numerators)
1517 error       |                         ^~~~~~~~~
1517 error ../src/libsass/src/ast.hpp:1614:25: 附注:use reference type to prevent copying
1517 error  1614 |         for (const auto numerator : numerators)
1517 error       |                         ^~~~~~~~~
1517 error       |                         &
1517 error ../src/libsass/src/ast.hpp:1616:25: 警告:loop variable ‘denominator’ creates a copy from type ‘const std::__cxx11::basic_string<char>’ [-Wrange-loop-construct]
1517 error  1616 |         for (const auto denominator : denominators)
1517 error       |                         ^~~~~~~~~~~
1517 error ../src/libsass/src/ast.hpp:1616:25: 附注:use reference type to prevent copying
1517 error  1616 |         for (const auto denominator : denominators)
1517 error       |                         ^~~~~~~~~~~
1517 error       |                         &
1517 error In file included from /home/cm/.node-gyp/16.11.1/include/node/v8.h:30,
1517 error                  from /home/cm/.node-gyp/16.11.1/include/node/node.h:63,
1517 error                  from ../../nan/nan.h:56,
1517 error                  from ../src/binding.cpp:1:
1517 error /home/cm/.node-gyp/16.11.1/include/node/v8-internal.h: 在函数‘void v8::internal::PerformCastCheck(T*)’中:
1517 error /home/cm/.node-gyp/16.11.1/include/node/v8-internal.h:492:38: 错误:‘remove_cv_t’ is not a member of ‘std’; did you mean ‘remove_cv’?
1517 error   492 |             !std::is_same<Data, std::remove_cv_t<T>>::value>::Perform(data);
1517 error       |                                      ^~~~~~~~~~~
1517 error       |                                      remove_cv
1517 error /home/cm/.node-gyp/16.11.1/include/node/v8-internal.h:492:38: 错误:‘remove_cv_t’ is not a member of ‘std’; did you mean ‘remove_cv’?
1517 error   492 |             !std::is_same<Data, std::remove_cv_t<T>>::value>::Perform(data);
1517 error       |                                      ^~~~~~~~~~~
1517 error       |                                      remove_cv
1517 error /home/cm/.node-gyp/16.11.1/include/node/v8-internal.h:492:50: 错误:模板第 2 个参数无效
1517 error   492 |             !std::is_same<Data, std::remove_cv_t<T>>::value>::Perform(data);
1517 error       |                                                  ^
1517 error /home/cm/.node-gyp/16.11.1/include/node/v8-internal.h:492:63: 错误:‘::Perform’未被声明
1517 error   492 |             !std::is_same<Data, std::remove_cv_t<T>>::value>::Perform(data);
1517 error       |                                                               ^~~~~~~
1517 error ../src/binding.cpp: 在函数‘Nan::NAN_METHOD_RETURN_TYPE render(Nan::NAN_METHOD_ARGS_TYPE)’中:
1517 error ../src/binding.cpp:284:80: 警告:cast between incompatible function types from ‘void (*)(uv_work_t*)’ {aka ‘void (*)(uv_work_s*)’} to ‘uv_after_work_cb’ {aka ‘void (*)(uv_work_s*, int)’} [-Wcast-function-type]
1517 error   284 |     int status = uv_queue_work(uv_default_loop(), &ctx_w->request, compile_it, (uv_after_work_cb)MakeCallback);
1517 error       |                                                                                ^~~~~~~~~~~~~~~~~~~~~~~~~~~~~~
1517 error ../src/binding.cpp: 在函数‘Nan::NAN_METHOD_RETURN_TYPE render_file(Nan::NAN_METHOD_ARGS_TYPE)’中:
1517 error ../src/binding.cpp:320:80: 警告:cast between incompatible function types from ‘void (*)(uv_work_t*)’ {aka ‘void (*)(uv_work_s*)’} to ‘uv_after_work_cb’ {aka ‘void (*)(uv_work_s*, int)’} [-Wcast-function-type]
1517 error   320 |     int status = uv_queue_work(uv_default_loop(), &ctx_w->request, compile_it, (uv_after_work_cb)MakeCallback);
1517 error       |                                                                                ^~~~~~~~~~~~~~~~~~~~~~~~~~~~~~
1517 error In file included from ../../nan/nan.h:56,
1517 error                  from ../src/binding.cpp:1:
1517 error ../src/binding.cpp: 在全局域:
1517 error /home/cm/.node-gyp/16.11.1/include/node/node.h:821:7: 警告:cast between incompatible function types from ‘void (*)(Nan::ADDON_REGISTER_FUNCTION_ARGS_TYPE)’ {aka ‘void (*)(v8::Local<v8::Object>)’} to ‘node::addon_register_func’ {aka ‘void (*)(v8::Local<v8::Object>, v8::Local<v8::Value>, void*)’} [-Wcast-function-type]
1517 error   821 |       (node::addon_register_func) (regfunc),                          \
1517 error       |       ^~~~~~~~~~~~~~~~~~~~~~~~~~~~~~~~~~~~~
1517 error /home/cm/.node-gyp/16.11.1/include/node/node.h:855:3: 附注:in expansion of macro ‘NODE_MODULE_X’
1517 error   855 |   NODE_MODULE_X(modname, regfunc, NULL, 0)  // NOLINT (readability/null_usage)
1517 error       |   ^~~~~~~~~~~~~
1517 error ../src/binding.cpp:358:1: 附注:in expansion of macro ‘NODE_MODULE’
1517 error   358 | NODE_MODULE(binding, RegisterModule);
1517 error       | ^~~~~~~~~~~
1517 error make: *** [binding.target.mk:129:Release/obj.target/binding/src/binding.o] 错误 1
1517 error gyp ERR! build error
1517 error gyp ERR! stack Error: `make` failed with exit code: 2
1517 error gyp ERR! stack     at ChildProcess.onExit (/it/www/vue/node_modules/node-gyp/lib/build.js:262:23)
1517 error gyp ERR! stack     at ChildProcess.emit (node:events:390:28)
1517 error gyp ERR! stack     at Process.ChildProcess._handle.onexit (node:internal/child_process:290:12)
1517 error gyp ERR! System Linux 5.14.12-arch1-1
1517 error gyp ERR! command "/usr/bin/node" "/it/www/vue/node_modules/node-gyp/bin/node-gyp.js" "rebuild" "--verbose" "--libsass_ext=" "--libsass_cflags=" "--libsass_ldflags=" "--libsass_library="
1517 error gyp ERR! cwd /it/www/vue/node_modules/node-sass
1517 error gyp ERR! node -v v16.11.1
1517 error gyp ERR! node-gyp -v v3.8.0
1517 error gyp ERR! not ok
1517 error Build failed with error code: 1
1518 verbose exit 1

离线

#2 2021-10-29 14:26:46

msupers
会员
注册时间: 2021-10-29
帖子: 1

Re: npm安装node-sass报错

先这样

npm config set sass_binary_site https://repo.huaweicloud.com/node-sass/
#如需安装node-sass
npm install node-sass --verbose

再这样

npm install

离线

#3 2021-10-30 19:09:16

chen05_20
会员
注册时间: 2021-04-02
帖子: 68

Re: npm安装node-sass报错

msupers 说:

先这样

npm config set sass_binary_site https://repo.huaweicloud.com/node-sass/
#如需安装node-sass
npm install node-sass --verbose

再这样

npm install

装不了4.x版本的,项目指定4.x版本的。出错内容应该差不多,还是包编译问题

npm ERR! make: 进入目录“/it/www/vue/node_modules/node-sass/build”
npm ERR!   g++ '-DNODE_GYP_MODULE_NAME=libsass' '-DUSING_UV_SHARED=1' '-DUSING_V8_SHARED=1' '-DV8_DEPRECATION_WARNINGS=1' '-DV8_DEPRECATION_WARNINGS' '-DV8_IMMINENT_DEPRECATION_WARNINGS' '-D_GLIBCXX_USE_CXX11_ABI=1' '-D_LARGEFILE_SOURCE' '-D_FILE_OFFSET_BITS=64' '-D__STDC_FORMAT_MACROS' '-DLIBSASS_VERSION="3.5.5"' -I/home/cm/.node-gyp/16.11.1/include/node -I/home/cm/.node-gyp/16.11.1/src -I/home/cm/.node-gyp/16.11.1/deps/openssl/config -I/home/cm/.node-gyp/16.11.1/deps/openssl/openssl/include -I/home/cm/.node-gyp/16.11.1/deps/uv/include -I/home/cm/.node-gyp/16.11.1/deps/zlib -I/home/cm/.node-gyp/16.11.1/deps/v8/include -I../src/libsass/include  -fPIC -pthread -Wall -Wextra -Wno-unused-parameter -m64 -O3 -fno-omit-frame-pointer -std=gnu++14 -std=c++0x -fexceptions -frtti -MMD -MF ./Release/.deps/Release/obj.target/libsass/src/libsass/src/ast.o.d.raw   -c -o Release/obj.target/libsass/src/libsass/src/ast.o ../src/libsass/src/ast.cpp
npm ERR!   g++ '-DNODE_GYP_MODULE_NAME=libsass' '-DUSING_UV_SHARED=1' '-DUSING_V8_SHARED=1' '-DV8_DEPRECATION_WARNINGS=1' '-DV8_DEPRECATION_WARNINGS' '-DV8_IMMINENT_DEPRECATION_WARNINGS' '-D_GLIBCXX_USE_CXX11_ABI=1' '-D_LARGEFILE_SOURCE' '-D_FILE_OFFSET_BITS=64' '-D__STDC_FORMAT_MACROS' '-DLIBSASS_VERSION="3.5.5"' -I/home/cm/.node-gyp/16.11.1/include/node -I/home/cm/.node-gyp/16.11.1/src -I/home/cm/.node-gyp/16.11.1/deps/openssl/config -I/home/cm/.node-gyp/16.11.1/deps/openssl/openssl/include -I/home/cm/.node-gyp/16.11.1/deps/uv/include -I/home/cm/.node-gyp/16.11.1/deps/zlib -I/home/cm/.node-gyp/16.11.1/deps/v8/include -I../src/libsass/include  -fPIC -pthread -Wall -Wextra -Wno-unused-parameter -m64 -O3 -fno-omit-frame-pointer -std=gnu++14 -std=c++0x -fexceptions -frtti -MMD -MF ./Release/.deps/Release/obj.target/libsass/src/libsass/src/ast_fwd_decl.o.d.raw   -c -o Release/obj.target/libsass/src/libsass/src/ast_fwd_decl.o ../src/libsass/src/ast_fwd_decl.cpp
npm ERR!   g++ '-DNODE_GYP_MODULE_NAME=libsass' '-DUSING_UV_SHARED=1' '-DUSING_V8_SHARED=1' '-DV8_DEPRECATION_WARNINGS=1' '-DV8_DEPRECATION_WARNINGS' '-DV8_IMMINENT_DEPRECATION_WARNINGS' '-D_GLIBCXX_USE_CXX11_ABI=1' '-D_LARGEFILE_SOURCE' '-D_FILE_OFFSET_BITS=64' '-D__STDC_FORMAT_MACROS' '-DLIBSASS_VERSION="3.5.5"' -I/home/cm/.node-gyp/16.11.1/include/node -I/home/cm/.node-gyp/16.11.1/src -I/home/cm/.node-gyp/16.11.1/deps/openssl/config -I/home/cm/.node-gyp/16.11.1/deps/openssl/openssl/include -I/home/cm/.node-gyp/16.11.1/deps/uv/include -I/home/cm/.node-gyp/16.11.1/deps/zlib -I/home/cm/.node-gyp/16.11.1/deps/v8/include -I../src/libsass/include  -fPIC -pthread -Wall -Wextra -Wno-unused-parameter -m64 -O3 -fno-omit-frame-pointer -std=gnu++14 -std=c++0x -fexceptions -frtti -MMD -MF ./Release/.deps/Release/obj.target/libsass/src/libsass/src/backtrace.o.d.raw   -c -o Release/obj.target/libsass/src/libsass/src/backtrace.o ../src/libsass/src/backtrace.cpp
npm ERR!   g++ '-DNODE_GYP_MODULE_NAME=libsass' '-DUSING_UV_SHARED=1' '-DUSING_V8_SHARED=1' '-DV8_DEPRECATION_WARNINGS=1' '-DV8_DEPRECATION_WARNINGS' '-DV8_IMMINENT_DEPRECATION_WARNINGS' '-D_GLIBCXX_USE_CXX11_ABI=1' '-D_LARGEFILE_SOURCE' '-D_FILE_OFFSET_BITS=64' '-D__STDC_FORMAT_MACROS' '-DLIBSASS_VERSION="3.5.5"' -I/home/cm/.node-gyp/16.11.1/include/node -I/home/cm/.node-gyp/16.11.1/src -I/home/cm/.node-gyp/16.11.1/deps/openssl/config -I/home/cm/.node-gyp/16.11.1/deps/openssl/openssl/include -I/home/cm/.node-gyp/16.11.1/deps/uv/include -I/home/cm/.node-gyp/16.11.1/deps/zlib -I/home/cm/.node-gyp/16.11.1/deps/v8/include -I../src/libsass/include  -fPIC -pthread -Wall -Wextra -Wno-unused-parameter -m64 -O3 -fno-omit-frame-pointer -std=gnu++14 -std=c++0x -fexceptions -frtti -MMD -MF ./Release/.deps/Release/obj.target/libsass/src/libsass/src/base64vlq.o.d.raw   -c -o Release/obj.target/libsass/src/libsass/src/base64vlq.o ../src/libsass/src/base64vlq.cpp
npm ERR!   g++ '-DNODE_GYP_MODULE_NAME=libsass' '-DUSING_UV_SHARED=1' '-DUSING_V8_SHARED=1' '-DV8_DEPRECATION_WARNINGS=1' '-DV8_DEPRECATION_WARNINGS' '-DV8_IMMINENT_DEPRECATION_WARNINGS' '-D_GLIBCXX_USE_CXX11_ABI=1' '-D_LARGEFILE_SOURCE' '-D_FILE_OFFSET_BITS=64' '-D__STDC_FORMAT_MACROS' '-DLIBSASS_VERSION="3.5.5"' -I/home/cm/.node-gyp/16.11.1/include/node -I/home/cm/.node-gyp/16.11.1/src -I/home/cm/.node-gyp/16.11.1/deps/openssl/config -I/home/cm/.node-gyp/16.11.1/deps/openssl/openssl/include -I/home/cm/.node-gyp/16.11.1/deps/uv/include -I/home/cm/.node-gyp/16.11.1/deps/zlib -I/home/cm/.node-gyp/16.11.1/deps/v8/include -I../src/libsass/include  -fPIC -pthread -Wall -Wextra -Wno-unused-parameter -m64 -O3 -fno-omit-frame-pointer -std=gnu++14 -std=c++0x -fexceptions -frtti -MMD -MF ./Release/.deps/Release/obj.target/libsass/src/libsass/src/bind.o.d.raw   -c -o Release/obj.target/libsass/src/libsass/src/bind.o ../src/libsass/src/bind.cpp
npm ERR!   cc '-DNODE_GYP_MODULE_NAME=libsass' '-DUSING_UV_SHARED=1' '-DUSING_V8_SHARED=1' '-DV8_DEPRECATION_WARNINGS=1' '-DV8_DEPRECATION_WARNINGS' '-DV8_IMMINENT_DEPRECATION_WARNINGS' '-D_GLIBCXX_USE_CXX11_ABI=1' '-D_LARGEFILE_SOURCE' '-D_FILE_OFFSET_BITS=64' '-D__STDC_FORMAT_MACROS' '-DLIBSASS_VERSION="3.5.5"' -I/home/cm/.node-gyp/16.11.1/include/node -I/home/cm/.node-gyp/16.11.1/src -I/home/cm/.node-gyp/16.11.1/deps/openssl/config -I/home/cm/.node-gyp/16.11.1/deps/openssl/openssl/include -I/home/cm/.node-gyp/16.11.1/deps/uv/include -I/home/cm/.node-gyp/16.11.1/deps/zlib -I/home/cm/.node-gyp/16.11.1/deps/v8/include -I../src/libsass/include  -fPIC -pthread -Wall -Wextra -Wno-unused-parameter -m64 -O3 -fno-omit-frame-pointer  -MMD -MF ./Release/.deps/Release/obj.target/libsass/src/libsass/src/cencode.o.d.raw   -c -o Release/obj.target/libsass/src/libsass/src/cencode.o ../src/libsass/src/cencode.c
npm ERR!   g++ '-DNODE_GYP_MODULE_NAME=libsass' '-DUSING_UV_SHARED=1' '-DUSING_V8_SHARED=1' '-DV8_DEPRECATION_WARNINGS=1' '-DV8_DEPRECATION_WARNINGS' '-DV8_IMMINENT_DEPRECATION_WARNINGS' '-D_GLIBCXX_USE_CXX11_ABI=1' '-D_LARGEFILE_SOURCE' '-D_FILE_OFFSET_BITS=64' '-D__STDC_FORMAT_MACROS' '-DLIBSASS_VERSION="3.5.5"' -I/home/cm/.node-gyp/16.11.1/include/node -I/home/cm/.node-gyp/16.11.1/src -I/home/cm/.node-gyp/16.11.1/deps/openssl/config -I/home/cm/.node-gyp/16.11.1/deps/openssl/openssl/include -I/home/cm/.node-gyp/16.11.1/deps/uv/include -I/home/cm/.node-gyp/16.11.1/deps/zlib -I/home/cm/.node-gyp/16.11.1/deps/v8/include -I../src/libsass/include  -fPIC -pthread -Wall -Wextra -Wno-unused-parameter -m64 -O3 -fno-omit-frame-pointer -std=gnu++14 -std=c++0x -fexceptions -frtti -MMD -MF ./Release/.deps/Release/obj.target/libsass/src/libsass/src/check_nesting.o.d.raw   -c -o Release/obj.target/libsass/src/libsass/src/check_nesting.o ../src/libsass/src/check_nesting.cpp
npm ERR!   g++ '-DNODE_GYP_MODULE_NAME=libsass' '-DUSING_UV_SHARED=1' '-DUSING_V8_SHARED=1' '-DV8_DEPRECATION_WARNINGS=1' '-DV8_DEPRECATION_WARNINGS' '-DV8_IMMINENT_DEPRECATION_WARNINGS' '-D_GLIBCXX_USE_CXX11_ABI=1' '-D_LARGEFILE_SOURCE' '-D_FILE_OFFSET_BITS=64' '-D__STDC_FORMAT_MACROS' '-DLIBSASS_VERSION="3.5.5"' -I/home/cm/.node-gyp/16.11.1/include/node -I/home/cm/.node-gyp/16.11.1/src -I/home/cm/.node-gyp/16.11.1/deps/openssl/config -I/home/cm/.node-gyp/16.11.1/deps/openssl/openssl/include -I/home/cm/.node-gyp/16.11.1/deps/uv/include -I/home/cm/.node-gyp/16.11.1/deps/zlib -I/home/cm/.node-gyp/16.11.1/deps/v8/include -I../src/libsass/include  -fPIC -pthread -Wall -Wextra -Wno-unused-parameter -m64 -O3 -fno-omit-frame-pointer -std=gnu++14 -std=c++0x -fexceptions -frtti -MMD -MF ./Release/.deps/Release/obj.target/libsass/src/libsass/src/color_maps.o.d.raw   -c -o Release/obj.target/libsass/src/libsass/src/color_maps.o ../src/libsass/src/color_maps.cpp
npm ERR!   g++ '-DNODE_GYP_MODULE_NAME=libsass' '-DUSING_UV_SHARED=1' '-DUSING_V8_SHARED=1' '-DV8_DEPRECATION_WARNINGS=1' '-DV8_DEPRECATION_WARNINGS' '-DV8_IMMINENT_DEPRECATION_WARNINGS' '-D_GLIBCXX_USE_CXX11_ABI=1' '-D_LARGEFILE_SOURCE' '-D_FILE_OFFSET_BITS=64' '-D__STDC_FORMAT_MACROS' '-DLIBSASS_VERSION="3.5.5"' -I/home/cm/.node-gyp/16.11.1/include/node -I/home/cm/.node-gyp/16.11.1/src -I/home/cm/.node-gyp/16.11.1/deps/openssl/config -I/home/cm/.node-gyp/16.11.1/deps/openssl/openssl/include -I/home/cm/.node-gyp/16.11.1/deps/uv/include -I/home/cm/.node-gyp/16.11.1/deps/zlib -I/home/cm/.node-gyp/16.11.1/deps/v8/include -I../src/libsass/include  -fPIC -pthread -Wall -Wextra -Wno-unused-parameter -m64 -O3 -fno-omit-frame-pointer -std=gnu++14 -std=c++0x -fexceptions -frtti -MMD -MF ./Release/.deps/Release/obj.target/libsass/src/libsass/src/constants.o.d.raw   -c -o Release/obj.target/libsass/src/libsass/src/constants.o ../src/libsass/src/constants.cpp
npm ERR!   g++ '-DNODE_GYP_MODULE_NAME=libsass' '-DUSING_UV_SHARED=1' '-DUSING_V8_SHARED=1' '-DV8_DEPRECATION_WARNINGS=1' '-DV8_DEPRECATION_WARNINGS' '-DV8_IMMINENT_DEPRECATION_WARNINGS' '-D_GLIBCXX_USE_CXX11_ABI=1' '-D_LARGEFILE_SOURCE' '-D_FILE_OFFSET_BITS=64' '-D__STDC_FORMAT_MACROS' '-DLIBSASS_VERSION="3.5.5"' -I/home/cm/.node-gyp/16.11.1/include/node -I/home/cm/.node-gyp/16.11.1/src -I/home/cm/.node-gyp/16.11.1/deps/openssl/config -I/home/cm/.node-gyp/16.11.1/deps/openssl/openssl/include -I/home/cm/.node-gyp/16.11.1/deps/uv/include -I/home/cm/.node-gyp/16.11.1/deps/zlib -I/home/cm/.node-gyp/16.11.1/deps/v8/include -I../src/libsass/include  -fPIC -pthread -Wall -Wextra -Wno-unused-parameter -m64 -O3 -fno-omit-frame-pointer -std=gnu++14 -std=c++0x -fexceptions -frtti -MMD -MF ./Release/.deps/Release/obj.target/libsass/src/libsass/src/context.o.d.raw   -c -o Release/obj.target/libsass/src/libsass/src/context.o ../src/libsass/src/context.cpp
npm ERR!   g++ '-DNODE_GYP_MODULE_NAME=libsass' '-DUSING_UV_SHARED=1' '-DUSING_V8_SHARED=1' '-DV8_DEPRECATION_WARNINGS=1' '-DV8_DEPRECATION_WARNINGS' '-DV8_IMMINENT_DEPRECATION_WARNINGS' '-D_GLIBCXX_USE_CXX11_ABI=1' '-D_LARGEFILE_SOURCE' '-D_FILE_OFFSET_BITS=64' '-D__STDC_FORMAT_MACROS' '-DLIBSASS_VERSION="3.5.5"' -I/home/cm/.node-gyp/16.11.1/include/node -I/home/cm/.node-gyp/16.11.1/src -I/home/cm/.node-gyp/16.11.1/deps/openssl/config -I/home/cm/.node-gyp/16.11.1/deps/openssl/openssl/include -I/home/cm/.node-gyp/16.11.1/deps/uv/include -I/home/cm/.node-gyp/16.11.1/deps/zlib -I/home/cm/.node-gyp/16.11.1/deps/v8/include -I../src/libsass/include  -fPIC -pthread -Wall -Wextra -Wno-unused-parameter -m64 -O3 -fno-omit-frame-pointer -std=gnu++14 -std=c++0x -fexceptions -frtti -MMD -MF ./Release/.deps/Release/obj.target/libsass/src/libsass/src/cssize.o.d.raw   -c -o Release/obj.target/libsass/src/libsass/src/cssize.o ../src/libsass/src/cssize.cpp
npm ERR!   g++ '-DNODE_GYP_MODULE_NAME=libsass' '-DUSING_UV_SHARED=1' '-DUSING_V8_SHARED=1' '-DV8_DEPRECATION_WARNINGS=1' '-DV8_DEPRECATION_WARNINGS' '-DV8_IMMINENT_DEPRECATION_WARNINGS' '-D_GLIBCXX_USE_CXX11_ABI=1' '-D_LARGEFILE_SOURCE' '-D_FILE_OFFSET_BITS=64' '-D__STDC_FORMAT_MACROS' '-DLIBSASS_VERSION="3.5.5"' -I/home/cm/.node-gyp/16.11.1/include/node -I/home/cm/.node-gyp/16.11.1/src -I/home/cm/.node-gyp/16.11.1/deps/openssl/config -I/home/cm/.node-gyp/16.11.1/deps/openssl/openssl/include -I/home/cm/.node-gyp/16.11.1/deps/uv/include -I/home/cm/.node-gyp/16.11.1/deps/zlib -I/home/cm/.node-gyp/16.11.1/deps/v8/include -I../src/libsass/include  -fPIC -pthread -Wall -Wextra -Wno-unused-parameter -m64 -O3 -fno-omit-frame-pointer -std=gnu++14 -std=c++0x -fexceptions -frtti -MMD -MF ./Release/.deps/Release/obj.target/libsass/src/libsass/src/emitter.o.d.raw   -c -o Release/obj.target/libsass/src/libsass/src/emitter.o ../src/libsass/src/emitter.cpp
npm ERR!   g++ '-DNODE_GYP_MODULE_NAME=libsass' '-DUSING_UV_SHARED=1' '-DUSING_V8_SHARED=1' '-DV8_DEPRECATION_WARNINGS=1' '-DV8_DEPRECATION_WARNINGS' '-DV8_IMMINENT_DEPRECATION_WARNINGS' '-D_GLIBCXX_USE_CXX11_ABI=1' '-D_LARGEFILE_SOURCE' '-D_FILE_OFFSET_BITS=64' '-D__STDC_FORMAT_MACROS' '-DLIBSASS_VERSION="3.5.5"' -I/home/cm/.node-gyp/16.11.1/include/node -I/home/cm/.node-gyp/16.11.1/src -I/home/cm/.node-gyp/16.11.1/deps/openssl/config -I/home/cm/.node-gyp/16.11.1/deps/openssl/openssl/include -I/home/cm/.node-gyp/16.11.1/deps/uv/include -I/home/cm/.node-gyp/16.11.1/deps/zlib -I/home/cm/.node-gyp/16.11.1/deps/v8/include -I../src/libsass/include  -fPIC -pthread -Wall -Wextra -Wno-unused-parameter -m64 -O3 -fno-omit-frame-pointer -std=gnu++14 -std=c++0x -fexceptions -frtti -MMD -MF ./Release/.deps/Release/obj.target/libsass/src/libsass/src/environment.o.d.raw   -c -o Release/obj.target/libsass/src/libsass/src/environment.o ../src/libsass/src/environment.cpp
npm ERR!   g++ '-DNODE_GYP_MODULE_NAME=libsass' '-DUSING_UV_SHARED=1' '-DUSING_V8_SHARED=1' '-DV8_DEPRECATION_WARNINGS=1' '-DV8_DEPRECATION_WARNINGS' '-DV8_IMMINENT_DEPRECATION_WARNINGS' '-D_GLIBCXX_USE_CXX11_ABI=1' '-D_LARGEFILE_SOURCE' '-D_FILE_OFFSET_BITS=64' '-D__STDC_FORMAT_MACROS' '-DLIBSASS_VERSION="3.5.5"' -I/home/cm/.node-gyp/16.11.1/include/node -I/home/cm/.node-gyp/16.11.1/src -I/home/cm/.node-gyp/16.11.1/deps/openssl/config -I/home/cm/.node-gyp/16.11.1/deps/openssl/openssl/include -I/home/cm/.node-gyp/16.11.1/deps/uv/include -I/home/cm/.node-gyp/16.11.1/deps/zlib -I/home/cm/.node-gyp/16.11.1/deps/v8/include -I../src/libsass/include  -fPIC -pthread -Wall -Wextra -Wno-unused-parameter -m64 -O3 -fno-omit-frame-pointer -std=gnu++14 -std=c++0x -fexceptions -frtti -MMD -MF ./Release/.deps/Release/obj.target/libsass/src/libsass/src/error_handling.o.d.raw   -c -o Release/obj.target/libsass/src/libsass/src/error_handling.o ../src/libsass/src/error_handling.cpp
npm ERR!   g++ '-DNODE_GYP_MODULE_NAME=libsass' '-DUSING_UV_SHARED=1' '-DUSING_V8_SHARED=1' '-DV8_DEPRECATION_WARNINGS=1' '-DV8_DEPRECATION_WARNINGS' '-DV8_IMMINENT_DEPRECATION_WARNINGS' '-D_GLIBCXX_USE_CXX11_ABI=1' '-D_LARGEFILE_SOURCE' '-D_FILE_OFFSET_BITS=64' '-D__STDC_FORMAT_MACROS' '-DLIBSASS_VERSION="3.5.5"' -I/home/cm/.node-gyp/16.11.1/include/node -I/home/cm/.node-gyp/16.11.1/src -I/home/cm/.node-gyp/16.11.1/deps/openssl/config -I/home/cm/.node-gyp/16.11.1/deps/openssl/openssl/include -I/home/cm/.node-gyp/16.11.1/deps/uv/include -I/home/cm/.node-gyp/16.11.1/deps/zlib -I/home/cm/.node-gyp/16.11.1/deps/v8/include -I../src/libsass/include  -fPIC -pthread -Wall -Wextra -Wno-unused-parameter -m64 -O3 -fno-omit-frame-pointer -std=gnu++14 -std=c++0x -fexceptions -frtti -MMD -MF ./Release/.deps/Release/obj.target/libsass/src/libsass/src/eval.o.d.raw   -c -o Release/obj.target/libsass/src/libsass/src/eval.o ../src/libsass/src/eval.cpp
npm ERR!   g++ '-DNODE_GYP_MODULE_NAME=libsass' '-DUSING_UV_SHARED=1' '-DUSING_V8_SHARED=1' '-DV8_DEPRECATION_WARNINGS=1' '-DV8_DEPRECATION_WARNINGS' '-DV8_IMMINENT_DEPRECATION_WARNINGS' '-D_GLIBCXX_USE_CXX11_ABI=1' '-D_LARGEFILE_SOURCE' '-D_FILE_OFFSET_BITS=64' '-D__STDC_FORMAT_MACROS' '-DLIBSASS_VERSION="3.5.5"' -I/home/cm/.node-gyp/16.11.1/include/node -I/home/cm/.node-gyp/16.11.1/src -I/home/cm/.node-gyp/16.11.1/deps/openssl/config -I/home/cm/.node-gyp/16.11.1/deps/openssl/openssl/include -I/home/cm/.node-gyp/16.11.1/deps/uv/include -I/home/cm/.node-gyp/16.11.1/deps/zlib -I/home/cm/.node-gyp/16.11.1/deps/v8/include -I../src/libsass/include  -fPIC -pthread -Wall -Wextra -Wno-unused-parameter -m64 -O3 -fno-omit-frame-pointer -std=gnu++14 -std=c++0x -fexceptions -frtti -MMD -MF ./Release/.deps/Release/obj.target/libsass/src/libsass/src/expand.o.d.raw   -c -o Release/obj.target/libsass/src/libsass/src/expand.o ../src/libsass/src/expand.cpp
npm ERR!   g++ '-DNODE_GYP_MODULE_NAME=libsass' '-DUSING_UV_SHARED=1' '-DUSING_V8_SHARED=1' '-DV8_DEPRECATION_WARNINGS=1' '-DV8_DEPRECATION_WARNINGS' '-DV8_IMMINENT_DEPRECATION_WARNINGS' '-D_GLIBCXX_USE_CXX11_ABI=1' '-D_LARGEFILE_SOURCE' '-D_FILE_OFFSET_BITS=64' '-D__STDC_FORMAT_MACROS' '-DLIBSASS_VERSION="3.5.5"' -I/home/cm/.node-gyp/16.11.1/include/node -I/home/cm/.node-gyp/16.11.1/src -I/home/cm/.node-gyp/16.11.1/deps/openssl/config -I/home/cm/.node-gyp/16.11.1/deps/openssl/openssl/include -I/home/cm/.node-gyp/16.11.1/deps/uv/include -I/home/cm/.node-gyp/16.11.1/deps/zlib -I/home/cm/.node-gyp/16.11.1/deps/v8/include -I../src/libsass/include  -fPIC -pthread -Wall -Wextra -Wno-unused-parameter -m64 -O3 -fno-omit-frame-pointer -std=gnu++14 -std=c++0x -fexceptions -frtti -MMD -MF ./Release/.deps/Release/obj.target/libsass/src/libsass/src/extend.o.d.raw   -c -o Release/obj.target/libsass/src/libsass/src/extend.o ../src/libsass/src/extend.cpp
npm ERR!   g++ '-DNODE_GYP_MODULE_NAME=libsass' '-DUSING_UV_SHARED=1' '-DUSING_V8_SHARED=1' '-DV8_DEPRECATION_WARNINGS=1' '-DV8_DEPRECATION_WARNINGS' '-DV8_IMMINENT_DEPRECATION_WARNINGS' '-D_GLIBCXX_USE_CXX11_ABI=1' '-D_LARGEFILE_SOURCE' '-D_FILE_OFFSET_BITS=64' '-D__STDC_FORMAT_MACROS' '-DLIBSASS_VERSION="3.5.5"' -I/home/cm/.node-gyp/16.11.1/include/node -I/home/cm/.node-gyp/16.11.1/src -I/home/cm/.node-gyp/16.11.1/deps/openssl/config -I/home/cm/.node-gyp/16.11.1/deps/openssl/openssl/include -I/home/cm/.node-gyp/16.11.1/deps/uv/include -I/home/cm/.node-gyp/16.11.1/deps/zlib -I/home/cm/.node-gyp/16.11.1/deps/v8/include -I../src/libsass/include  -fPIC -pthread -Wall -Wextra -Wno-unused-parameter -m64 -O3 -fno-omit-frame-pointer -std=gnu++14 -std=c++0x -fexceptions -frtti -MMD -MF ./Release/.deps/Release/obj.target/libsass/src/libsass/src/file.o.d.raw   -c -o Release/obj.target/libsass/src/libsass/src/file.o ../src/libsass/src/file.cpp
npm ERR!   g++ '-DNODE_GYP_MODULE_NAME=libsass' '-DUSING_UV_SHARED=1' '-DUSING_V8_SHARED=1' '-DV8_DEPRECATION_WARNINGS=1' '-DV8_DEPRECATION_WARNINGS' '-DV8_IMMINENT_DEPRECATION_WARNINGS' '-D_GLIBCXX_USE_CXX11_ABI=1' '-D_LARGEFILE_SOURCE' '-D_FILE_OFFSET_BITS=64' '-D__STDC_FORMAT_MACROS' '-DLIBSASS_VERSION="3.5.5"' -I/home/cm/.node-gyp/16.11.1/include/node -I/home/cm/.node-gyp/16.11.1/src -I/home/cm/.node-gyp/16.11.1/deps/openssl/config -I/home/cm/.node-gyp/16.11.1/deps/openssl/openssl/include -I/home/cm/.node-gyp/16.11.1/deps/uv/include -I/home/cm/.node-gyp/16.11.1/deps/zlib -I/home/cm/.node-gyp/16.11.1/deps/v8/include -I../src/libsass/include  -fPIC -pthread -Wall -Wextra -Wno-unused-parameter -m64 -O3 -fno-omit-frame-pointer -std=gnu++14 -std=c++0x -fexceptions -frtti -MMD -MF ./Release/.deps/Release/obj.target/libsass/src/libsass/src/functions.o.d.raw   -c -o Release/obj.target/libsass/src/libsass/src/functions.o ../src/libsass/src/functions.cpp
npm ERR!   g++ '-DNODE_GYP_MODULE_NAME=libsass' '-DUSING_UV_SHARED=1' '-DUSING_V8_SHARED=1' '-DV8_DEPRECATION_WARNINGS=1' '-DV8_DEPRECATION_WARNINGS' '-DV8_IMMINENT_DEPRECATION_WARNINGS' '-D_GLIBCXX_USE_CXX11_ABI=1' '-D_LARGEFILE_SOURCE' '-D_FILE_OFFSET_BITS=64' '-D__STDC_FORMAT_MACROS' '-DLIBSASS_VERSION="3.5.5"' -I/home/cm/.node-gyp/16.11.1/include/node -I/home/cm/.node-gyp/16.11.1/src -I/home/cm/.node-gyp/16.11.1/deps/openssl/config -I/home/cm/.node-gyp/16.11.1/deps/openssl/openssl/include -I/home/cm/.node-gyp/16.11.1/deps/uv/include -I/home/cm/.node-gyp/16.11.1/deps/zlib -I/home/cm/.node-gyp/16.11.1/deps/v8/include -I../src/libsass/include  -fPIC -pthread -Wall -Wextra -Wno-unused-parameter -m64 -O3 -fno-omit-frame-pointer -std=gnu++14 -std=c++0x -fexceptions -frtti -MMD -MF ./Release/.deps/Release/obj.target/libsass/src/libsass/src/inspect.o.d.raw   -c -o Release/obj.target/libsass/src/libsass/src/inspect.o ../src/libsass/src/inspect.cpp
npm ERR!   g++ '-DNODE_GYP_MODULE_NAME=libsass' '-DUSING_UV_SHARED=1' '-DUSING_V8_SHARED=1' '-DV8_DEPRECATION_WARNINGS=1' '-DV8_DEPRECATION_WARNINGS' '-DV8_IMMINENT_DEPRECATION_WARNINGS' '-D_GLIBCXX_USE_CXX11_ABI=1' '-D_LARGEFILE_SOURCE' '-D_FILE_OFFSET_BITS=64' '-D__STDC_FORMAT_MACROS' '-DLIBSASS_VERSION="3.5.5"' -I/home/cm/.node-gyp/16.11.1/include/node -I/home/cm/.node-gyp/16.11.1/src -I/home/cm/.node-gyp/16.11.1/deps/openssl/config -I/home/cm/.node-gyp/16.11.1/deps/openssl/openssl/include -I/home/cm/.node-gyp/16.11.1/deps/uv/include -I/home/cm/.node-gyp/16.11.1/deps/zlib -I/home/cm/.node-gyp/16.11.1/deps/v8/include -I../src/libsass/include  -fPIC -pthread -Wall -Wextra -Wno-unused-parameter -m64 -O3 -fno-omit-frame-pointer -std=gnu++14 -std=c++0x -fexceptions -frtti -MMD -MF ./Release/.deps/Release/obj.target/libsass/src/libsass/src/json.o.d.raw   -c -o Release/obj.target/libsass/src/libsass/src/json.o ../src/libsass/src/json.cpp
npm ERR!   g++ '-DNODE_GYP_MODULE_NAME=libsass' '-DUSING_UV_SHARED=1' '-DUSING_V8_SHARED=1' '-DV8_DEPRECATION_WARNINGS=1' '-DV8_DEPRECATION_WARNINGS' '-DV8_IMMINENT_DEPRECATION_WARNINGS' '-D_GLIBCXX_USE_CXX11_ABI=1' '-D_LARGEFILE_SOURCE' '-D_FILE_OFFSET_BITS=64' '-D__STDC_FORMAT_MACROS' '-DLIBSASS_VERSION="3.5.5"' -I/home/cm/.node-gyp/16.11.1/include/node -I/home/cm/.node-gyp/16.11.1/src -I/home/cm/.node-gyp/16.11.1/deps/openssl/config -I/home/cm/.node-gyp/16.11.1/deps/openssl/openssl/include -I/home/cm/.node-gyp/16.11.1/deps/uv/include -I/home/cm/.node-gyp/16.11.1/deps/zlib -I/home/cm/.node-gyp/16.11.1/deps/v8/include -I../src/libsass/include  -fPIC -pthread -Wall -Wextra -Wno-unused-parameter -m64 -O3 -fno-omit-frame-pointer -std=gnu++14 -std=c++0x -fexceptions -frtti -MMD -MF ./Release/.deps/Release/obj.target/libsass/src/libsass/src/lexer.o.d.raw   -c -o Release/obj.target/libsass/src/libsass/src/lexer.o ../src/libsass/src/lexer.cpp
npm ERR!   g++ '-DNODE_GYP_MODULE_NAME=libsass' '-DUSING_UV_SHARED=1' '-DUSING_V8_SHARED=1' '-DV8_DEPRECATION_WARNINGS=1' '-DV8_DEPRECATION_WARNINGS' '-DV8_IMMINENT_DEPRECATION_WARNINGS' '-D_GLIBCXX_USE_CXX11_ABI=1' '-D_LARGEFILE_SOURCE' '-D_FILE_OFFSET_BITS=64' '-D__STDC_FORMAT_MACROS' '-DLIBSASS_VERSION="3.5.5"' -I/home/cm/.node-gyp/16.11.1/include/node -I/home/cm/.node-gyp/16.11.1/src -I/home/cm/.node-gyp/16.11.1/deps/openssl/config -I/home/cm/.node-gyp/16.11.1/deps/openssl/openssl/include -I/home/cm/.node-gyp/16.11.1/deps/uv/include -I/home/cm/.node-gyp/16.11.1/deps/zlib -I/home/cm/.node-gyp/16.11.1/deps/v8/include -I../src/libsass/include  -fPIC -pthread -Wall -Wextra -Wno-unused-parameter -m64 -O3 -fno-omit-frame-pointer -std=gnu++14 -std=c++0x -fexceptions -frtti -MMD -MF ./Release/.deps/Release/obj.target/libsass/src/libsass/src/listize.o.d.raw   -c -o Release/obj.target/libsass/src/libsass/src/listize.o ../src/libsass/src/listize.cpp
npm ERR!   g++ '-DNODE_GYP_MODULE_NAME=libsass' '-DUSING_UV_SHARED=1' '-DUSING_V8_SHARED=1' '-DV8_DEPRECATION_WARNINGS=1' '-DV8_DEPRECATION_WARNINGS' '-DV8_IMMINENT_DEPRECATION_WARNINGS' '-D_GLIBCXX_USE_CXX11_ABI=1' '-D_LARGEFILE_SOURCE' '-D_FILE_OFFSET_BITS=64' '-D__STDC_FORMAT_MACROS' '-DLIBSASS_VERSION="3.5.5"' -I/home/cm/.node-gyp/16.11.1/include/node -I/home/cm/.node-gyp/16.11.1/src -I/home/cm/.node-gyp/16.11.1/deps/openssl/config -I/home/cm/.node-gyp/16.11.1/deps/openssl/openssl/include -I/home/cm/.node-gyp/16.11.1/deps/uv/include -I/home/cm/.node-gyp/16.11.1/deps/zlib -I/home/cm/.node-gyp/16.11.1/deps/v8/include -I../src/libsass/include  -fPIC -pthread -Wall -Wextra -Wno-unused-parameter -m64 -O3 -fno-omit-frame-pointer -std=gnu++14 -std=c++0x -fexceptions -frtti -MMD -MF ./Release/.deps/Release/obj.target/libsass/src/libsass/src/memory/SharedPtr.o.d.raw   -c -o Release/obj.target/libsass/src/libsass/src/memory/SharedPtr.o ../src/libsass/src/memory/SharedPtr.cpp
npm ERR!   g++ '-DNODE_GYP_MODULE_NAME=libsass' '-DUSING_UV_SHARED=1' '-DUSING_V8_SHARED=1' '-DV8_DEPRECATION_WARNINGS=1' '-DV8_DEPRECATION_WARNINGS' '-DV8_IMMINENT_DEPRECATION_WARNINGS' '-D_GLIBCXX_USE_CXX11_ABI=1' '-D_LARGEFILE_SOURCE' '-D_FILE_OFFSET_BITS=64' '-D__STDC_FORMAT_MACROS' '-DLIBSASS_VERSION="3.5.5"' -I/home/cm/.node-gyp/16.11.1/include/node -I/home/cm/.node-gyp/16.11.1/src -I/home/cm/.node-gyp/16.11.1/deps/openssl/config -I/home/cm/.node-gyp/16.11.1/deps/openssl/openssl/include -I/home/cm/.node-gyp/16.11.1/deps/uv/include -I/home/cm/.node-gyp/16.11.1/deps/zlib -I/home/cm/.node-gyp/16.11.1/deps/v8/include -I../src/libsass/include  -fPIC -pthread -Wall -Wextra -Wno-unused-parameter -m64 -O3 -fno-omit-frame-pointer -std=gnu++14 -std=c++0x -fexceptions -frtti -MMD -MF ./Release/.deps/Release/obj.target/libsass/src/libsass/src/node.o.d.raw   -c -o Release/obj.target/libsass/src/libsass/src/node.o ../src/libsass/src/node.cpp
npm ERR!   g++ '-DNODE_GYP_MODULE_NAME=libsass' '-DUSING_UV_SHARED=1' '-DUSING_V8_SHARED=1' '-DV8_DEPRECATION_WARNINGS=1' '-DV8_DEPRECATION_WARNINGS' '-DV8_IMMINENT_DEPRECATION_WARNINGS' '-D_GLIBCXX_USE_CXX11_ABI=1' '-D_LARGEFILE_SOURCE' '-D_FILE_OFFSET_BITS=64' '-D__STDC_FORMAT_MACROS' '-DLIBSASS_VERSION="3.5.5"' -I/home/cm/.node-gyp/16.11.1/include/node -I/home/cm/.node-gyp/16.11.1/src -I/home/cm/.node-gyp/16.11.1/deps/openssl/config -I/home/cm/.node-gyp/16.11.1/deps/openssl/openssl/include -I/home/cm/.node-gyp/16.11.1/deps/uv/include -I/home/cm/.node-gyp/16.11.1/deps/zlib -I/home/cm/.node-gyp/16.11.1/deps/v8/include -I../src/libsass/include  -fPIC -pthread -Wall -Wextra -Wno-unused-parameter -m64 -O3 -fno-omit-frame-pointer -std=gnu++14 -std=c++0x -fexceptions -frtti -MMD -MF ./Release/.deps/Release/obj.target/libsass/src/libsass/src/operators.o.d.raw   -c -o Release/obj.target/libsass/src/libsass/src/operators.o ../src/libsass/src/operators.cpp
npm ERR!   g++ '-DNODE_GYP_MODULE_NAME=libsass' '-DUSING_UV_SHARED=1' '-DUSING_V8_SHARED=1' '-DV8_DEPRECATION_WARNINGS=1' '-DV8_DEPRECATION_WARNINGS' '-DV8_IMMINENT_DEPRECATION_WARNINGS' '-D_GLIBCXX_USE_CXX11_ABI=1' '-D_LARGEFILE_SOURCE' '-D_FILE_OFFSET_BITS=64' '-D__STDC_FORMAT_MACROS' '-DLIBSASS_VERSION="3.5.5"' -I/home/cm/.node-gyp/16.11.1/include/node -I/home/cm/.node-gyp/16.11.1/src -I/home/cm/.node-gyp/16.11.1/deps/openssl/config -I/home/cm/.node-gyp/16.11.1/deps/openssl/openssl/include -I/home/cm/.node-gyp/16.11.1/deps/uv/include -I/home/cm/.node-gyp/16.11.1/deps/zlib -I/home/cm/.node-gyp/16.11.1/deps/v8/include -I../src/libsass/include  -fPIC -pthread -Wall -Wextra -Wno-unused-parameter -m64 -O3 -fno-omit-frame-pointer -std=gnu++14 -std=c++0x -fexceptions -frtti -MMD -MF ./Release/.deps/Release/obj.target/libsass/src/libsass/src/output.o.d.raw   -c -o Release/obj.target/libsass/src/libsass/src/output.o ../src/libsass/src/output.cpp
npm ERR!   g++ '-DNODE_GYP_MODULE_NAME=libsass' '-DUSING_UV_SHARED=1' '-DUSING_V8_SHARED=1' '-DV8_DEPRECATION_WARNINGS=1' '-DV8_DEPRECATION_WARNINGS' '-DV8_IMMINENT_DEPRECATION_WARNINGS' '-D_GLIBCXX_USE_CXX11_ABI=1' '-D_LARGEFILE_SOURCE' '-D_FILE_OFFSET_BITS=64' '-D__STDC_FORMAT_MACROS' '-DLIBSASS_VERSION="3.5.5"' -I/home/cm/.node-gyp/16.11.1/include/node -I/home/cm/.node-gyp/16.11.1/src -I/home/cm/.node-gyp/16.11.1/deps/openssl/config -I/home/cm/.node-gyp/16.11.1/deps/openssl/openssl/include -I/home/cm/.node-gyp/16.11.1/deps/uv/include -I/home/cm/.node-gyp/16.11.1/deps/zlib -I/home/cm/.node-gyp/16.11.1/deps/v8/include -I../src/libsass/include  -fPIC -pthread -Wall -Wextra -Wno-unused-parameter -m64 -O3 -fno-omit-frame-pointer -std=gnu++14 -std=c++0x -fexceptions -frtti -MMD -MF ./Release/.deps/Release/obj.target/libsass/src/libsass/src/parser.o.d.raw   -c -o Release/obj.target/libsass/src/libsass/src/parser.o ../src/libsass/src/parser.cpp
npm ERR!   g++ '-DNODE_GYP_MODULE_NAME=libsass' '-DUSING_UV_SHARED=1' '-DUSING_V8_SHARED=1' '-DV8_DEPRECATION_WARNINGS=1' '-DV8_DEPRECATION_WARNINGS' '-DV8_IMMINENT_DEPRECATION_WARNINGS' '-D_GLIBCXX_USE_CXX11_ABI=1' '-D_LARGEFILE_SOURCE' '-D_FILE_OFFSET_BITS=64' '-D__STDC_FORMAT_MACROS' '-DLIBSASS_VERSION="3.5.5"' -I/home/cm/.node-gyp/16.11.1/include/node -I/home/cm/.node-gyp/16.11.1/src -I/home/cm/.node-gyp/16.11.1/deps/openssl/config -I/home/cm/.node-gyp/16.11.1/deps/openssl/openssl/include -I/home/cm/.node-gyp/16.11.1/deps/uv/include -I/home/cm/.node-gyp/16.11.1/deps/zlib -I/home/cm/.node-gyp/16.11.1/deps/v8/include -I../src/libsass/include  -fPIC -pthread -Wall -Wextra -Wno-unused-parameter -m64 -O3 -fno-omit-frame-pointer -std=gnu++14 -std=c++0x -fexceptions -frtti -MMD -MF ./Release/.deps/Release/obj.target/libsass/src/libsass/src/plugins.o.d.raw   -c -o Release/obj.target/libsass/src/libsass/src/plugins.o ../src/libsass/src/plugins.cpp
npm ERR!   g++ '-DNODE_GYP_MODULE_NAME=libsass' '-DUSING_UV_SHARED=1' '-DUSING_V8_SHARED=1' '-DV8_DEPRECATION_WARNINGS=1' '-DV8_DEPRECATION_WARNINGS' '-DV8_IMMINENT_DEPRECATION_WARNINGS' '-D_GLIBCXX_USE_CXX11_ABI=1' '-D_LARGEFILE_SOURCE' '-D_FILE_OFFSET_BITS=64' '-D__STDC_FORMAT_MACROS' '-DLIBSASS_VERSION="3.5.5"' -I/home/cm/.node-gyp/16.11.1/include/node -I/home/cm/.node-gyp/16.11.1/src -I/home/cm/.node-gyp/16.11.1/deps/openssl/config -I/home/cm/.node-gyp/16.11.1/deps/openssl/openssl/include -I/home/cm/.node-gyp/16.11.1/deps/uv/include -I/home/cm/.node-gyp/16.11.1/deps/zlib -I/home/cm/.node-gyp/16.11.1/deps/v8/include -I../src/libsass/include  -fPIC -pthread -Wall -Wextra -Wno-unused-parameter -m64 -O3 -fno-omit-frame-pointer -std=gnu++14 -std=c++0x -fexceptions -frtti -MMD -MF ./Release/.deps/Release/obj.target/libsass/src/libsass/src/position.o.d.raw   -c -o Release/obj.target/libsass/src/libsass/src/position.o ../src/libsass/src/position.cpp
npm ERR!   g++ '-DNODE_GYP_MODULE_NAME=libsass' '-DUSING_UV_SHARED=1' '-DUSING_V8_SHARED=1' '-DV8_DEPRECATION_WARNINGS=1' '-DV8_DEPRECATION_WARNINGS' '-DV8_IMMINENT_DEPRECATION_WARNINGS' '-D_GLIBCXX_USE_CXX11_ABI=1' '-D_LARGEFILE_SOURCE' '-D_FILE_OFFSET_BITS=64' '-D__STDC_FORMAT_MACROS' '-DLIBSASS_VERSION="3.5.5"' -I/home/cm/.node-gyp/16.11.1/include/node -I/home/cm/.node-gyp/16.11.1/src -I/home/cm/.node-gyp/16.11.1/deps/openssl/config -I/home/cm/.node-gyp/16.11.1/deps/openssl/openssl/include -I/home/cm/.node-gyp/16.11.1/deps/uv/include -I/home/cm/.node-gyp/16.11.1/deps/zlib -I/home/cm/.node-gyp/16.11.1/deps/v8/include -I../src/libsass/include  -fPIC -pthread -Wall -Wextra -Wno-unused-parameter -m64 -O3 -fno-omit-frame-pointer -std=gnu++14 -std=c++0x -fexceptions -frtti -MMD -MF ./Release/.deps/Release/obj.target/libsass/src/libsass/src/prelexer.o.d.raw   -c -o Release/obj.target/libsass/src/libsass/src/prelexer.o ../src/libsass/src/prelexer.cpp
npm ERR!   g++ '-DNODE_GYP_MODULE_NAME=libsass' '-DUSING_UV_SHARED=1' '-DUSING_V8_SHARED=1' '-DV8_DEPRECATION_WARNINGS=1' '-DV8_DEPRECATION_WARNINGS' '-DV8_IMMINENT_DEPRECATION_WARNINGS' '-D_GLIBCXX_USE_CXX11_ABI=1' '-D_LARGEFILE_SOURCE' '-D_FILE_OFFSET_BITS=64' '-D__STDC_FORMAT_MACROS' '-DLIBSASS_VERSION="3.5.5"' -I/home/cm/.node-gyp/16.11.1/include/node -I/home/cm/.node-gyp/16.11.1/src -I/home/cm/.node-gyp/16.11.1/deps/openssl/config -I/home/cm/.node-gyp/16.11.1/deps/openssl/openssl/include -I/home/cm/.node-gyp/16.11.1/deps/uv/include -I/home/cm/.node-gyp/16.11.1/deps/zlib -I/home/cm/.node-gyp/16.11.1/deps/v8/include -I../src/libsass/include  -fPIC -pthread -Wall -Wextra -Wno-unused-parameter -m64 -O3 -fno-omit-frame-pointer -std=gnu++14 -std=c++0x -fexceptions -frtti -MMD -MF ./Release/.deps/Release/obj.target/libsass/src/libsass/src/remove_placeholders.o.d.raw   -c -o Release/obj.target/libsass/src/libsass/src/remove_placeholders.o ../src/libsass/src/remove_placeholders.cpp
npm ERR!   g++ '-DNODE_GYP_MODULE_NAME=libsass' '-DUSING_UV_SHARED=1' '-DUSING_V8_SHARED=1' '-DV8_DEPRECATION_WARNINGS=1' '-DV8_DEPRECATION_WARNINGS' '-DV8_IMMINENT_DEPRECATION_WARNINGS' '-D_GLIBCXX_USE_CXX11_ABI=1' '-D_LARGEFILE_SOURCE' '-D_FILE_OFFSET_BITS=64' '-D__STDC_FORMAT_MACROS' '-DLIBSASS_VERSION="3.5.5"' -I/home/cm/.node-gyp/16.11.1/include/node -I/home/cm/.node-gyp/16.11.1/src -I/home/cm/.node-gyp/16.11.1/deps/openssl/config -I/home/cm/.node-gyp/16.11.1/deps/openssl/openssl/include -I/home/cm/.node-gyp/16.11.1/deps/uv/include -I/home/cm/.node-gyp/16.11.1/deps/zlib -I/home/cm/.node-gyp/16.11.1/deps/v8/include -I../src/libsass/include  -fPIC -pthread -Wall -Wextra -Wno-unused-parameter -m64 -O3 -fno-omit-frame-pointer -std=gnu++14 -std=c++0x -fexceptions -frtti -MMD -MF ./Release/.deps/Release/obj.target/libsass/src/libsass/src/sass.o.d.raw   -c -o Release/obj.target/libsass/src/libsass/src/sass.o ../src/libsass/src/sass.cpp
npm ERR!   g++ '-DNODE_GYP_MODULE_NAME=libsass' '-DUSING_UV_SHARED=1' '-DUSING_V8_SHARED=1' '-DV8_DEPRECATION_WARNINGS=1' '-DV8_DEPRECATION_WARNINGS' '-DV8_IMMINENT_DEPRECATION_WARNINGS' '-D_GLIBCXX_USE_CXX11_ABI=1' '-D_LARGEFILE_SOURCE' '-D_FILE_OFFSET_BITS=64' '-D__STDC_FORMAT_MACROS' '-DLIBSASS_VERSION="3.5.5"' -I/home/cm/.node-gyp/16.11.1/include/node -I/home/cm/.node-gyp/16.11.1/src -I/home/cm/.node-gyp/16.11.1/deps/openssl/config -I/home/cm/.node-gyp/16.11.1/deps/openssl/openssl/include -I/home/cm/.node-gyp/16.11.1/deps/uv/include -I/home/cm/.node-gyp/16.11.1/deps/zlib -I/home/cm/.node-gyp/16.11.1/deps/v8/include -I../src/libsass/include  -fPIC -pthread -Wall -Wextra -Wno-unused-parameter -m64 -O3 -fno-omit-frame-pointer -std=gnu++14 -std=c++0x -fexceptions -frtti -MMD -MF ./Release/.deps/Release/obj.target/libsass/src/libsass/src/sass2scss.o.d.raw   -c -o Release/obj.target/libsass/src/libsass/src/sass2scss.o ../src/libsass/src/sass2scss.cpp
npm ERR!   g++ '-DNODE_GYP_MODULE_NAME=libsass' '-DUSING_UV_SHARED=1' '-DUSING_V8_SHARED=1' '-DV8_DEPRECATION_WARNINGS=1' '-DV8_DEPRECATION_WARNINGS' '-DV8_IMMINENT_DEPRECATION_WARNINGS' '-D_GLIBCXX_USE_CXX11_ABI=1' '-D_LARGEFILE_SOURCE' '-D_FILE_OFFSET_BITS=64' '-D__STDC_FORMAT_MACROS' '-DLIBSASS_VERSION="3.5.5"' -I/home/cm/.node-gyp/16.11.1/include/node -I/home/cm/.node-gyp/16.11.1/src -I/home/cm/.node-gyp/16.11.1/deps/openssl/config -I/home/cm/.node-gyp/16.11.1/deps/openssl/openssl/include -I/home/cm/.node-gyp/16.11.1/deps/uv/include -I/home/cm/.node-gyp/16.11.1/deps/zlib -I/home/cm/.node-gyp/16.11.1/deps/v8/include -I../src/libsass/include  -fPIC -pthread -Wall -Wextra -Wno-unused-parameter -m64 -O3 -fno-omit-frame-pointer -std=gnu++14 -std=c++0x -fexceptions -frtti -MMD -MF ./Release/.deps/Release/obj.target/libsass/src/libsass/src/sass_context.o.d.raw   -c -o Release/obj.target/libsass/src/libsass/src/sass_context.o ../src/libsass/src/sass_context.cpp
npm ERR!   g++ '-DNODE_GYP_MODULE_NAME=libsass' '-DUSING_UV_SHARED=1' '-DUSING_V8_SHARED=1' '-DV8_DEPRECATION_WARNINGS=1' '-DV8_DEPRECATION_WARNINGS' '-DV8_IMMINENT_DEPRECATION_WARNINGS' '-D_GLIBCXX_USE_CXX11_ABI=1' '-D_LARGEFILE_SOURCE' '-D_FILE_OFFSET_BITS=64' '-D__STDC_FORMAT_MACROS' '-DLIBSASS_VERSION="3.5.5"' -I/home/cm/.node-gyp/16.11.1/include/node -I/home/cm/.node-gyp/16.11.1/src -I/home/cm/.node-gyp/16.11.1/deps/openssl/config -I/home/cm/.node-gyp/16.11.1/deps/openssl/openssl/include -I/home/cm/.node-gyp/16.11.1/deps/uv/include -I/home/cm/.node-gyp/16.11.1/deps/zlib -I/home/cm/.node-gyp/16.11.1/deps/v8/include -I../src/libsass/include  -fPIC -pthread -Wall -Wextra -Wno-unused-parameter -m64 -O3 -fno-omit-frame-pointer -std=gnu++14 -std=c++0x -fexceptions -frtti -MMD -MF ./Release/.deps/Release/obj.target/libsass/src/libsass/src/sass_functions.o.d.raw   -c -o Release/obj.target/libsass/src/libsass/src/sass_functions.o ../src/libsass/src/sass_functions.cpp
npm ERR!   g++ '-DNODE_GYP_MODULE_NAME=libsass' '-DUSING_UV_SHARED=1' '-DUSING_V8_SHARED=1' '-DV8_DEPRECATION_WARNINGS=1' '-DV8_DEPRECATION_WARNINGS' '-DV8_IMMINENT_DEPRECATION_WARNINGS' '-D_GLIBCXX_USE_CXX11_ABI=1' '-D_LARGEFILE_SOURCE' '-D_FILE_OFFSET_BITS=64' '-D__STDC_FORMAT_MACROS' '-DLIBSASS_VERSION="3.5.5"' -I/home/cm/.node-gyp/16.11.1/include/node -I/home/cm/.node-gyp/16.11.1/src -I/home/cm/.node-gyp/16.11.1/deps/openssl/config -I/home/cm/.node-gyp/16.11.1/deps/openssl/openssl/include -I/home/cm/.node-gyp/16.11.1/deps/uv/include -I/home/cm/.node-gyp/16.11.1/deps/zlib -I/home/cm/.node-gyp/16.11.1/deps/v8/include -I../src/libsass/include  -fPIC -pthread -Wall -Wextra -Wno-unused-parameter -m64 -O3 -fno-omit-frame-pointer -std=gnu++14 -std=c++0x -fexceptions -frtti -MMD -MF ./Release/.deps/Release/obj.target/libsass/src/libsass/src/sass_util.o.d.raw   -c -o Release/obj.target/libsass/src/libsass/src/sass_util.o ../src/libsass/src/sass_util.cpp
npm ERR!   g++ '-DNODE_GYP_MODULE_NAME=libsass' '-DUSING_UV_SHARED=1' '-DUSING_V8_SHARED=1' '-DV8_DEPRECATION_WARNINGS=1' '-DV8_DEPRECATION_WARNINGS' '-DV8_IMMINENT_DEPRECATION_WARNINGS' '-D_GLIBCXX_USE_CXX11_ABI=1' '-D_LARGEFILE_SOURCE' '-D_FILE_OFFSET_BITS=64' '-D__STDC_FORMAT_MACROS' '-DLIBSASS_VERSION="3.5.5"' -I/home/cm/.node-gyp/16.11.1/include/node -I/home/cm/.node-gyp/16.11.1/src -I/home/cm/.node-gyp/16.11.1/deps/openssl/config -I/home/cm/.node-gyp/16.11.1/deps/openssl/openssl/include -I/home/cm/.node-gyp/16.11.1/deps/uv/include -I/home/cm/.node-gyp/16.11.1/deps/zlib -I/home/cm/.node-gyp/16.11.1/deps/v8/include -I../src/libsass/include  -fPIC -pthread -Wall -Wextra -Wno-unused-parameter -m64 -O3 -fno-omit-frame-pointer -std=gnu++14 -std=c++0x -fexceptions -frtti -MMD -MF ./Release/.deps/Release/obj.target/libsass/src/libsass/src/sass_values.o.d.raw   -c -o Release/obj.target/libsass/src/libsass/src/sass_values.o ../src/libsass/src/sass_values.cpp
npm ERR!   g++ '-DNODE_GYP_MODULE_NAME=libsass' '-DUSING_UV_SHARED=1' '-DUSING_V8_SHARED=1' '-DV8_DEPRECATION_WARNINGS=1' '-DV8_DEPRECATION_WARNINGS' '-DV8_IMMINENT_DEPRECATION_WARNINGS' '-D_GLIBCXX_USE_CXX11_ABI=1' '-D_LARGEFILE_SOURCE' '-D_FILE_OFFSET_BITS=64' '-D__STDC_FORMAT_MACROS' '-DLIBSASS_VERSION="3.5.5"' -I/home/cm/.node-gyp/16.11.1/include/node -I/home/cm/.node-gyp/16.11.1/src -I/home/cm/.node-gyp/16.11.1/deps/openssl/config -I/home/cm/.node-gyp/16.11.1/deps/openssl/openssl/include -I/home/cm/.node-gyp/16.11.1/deps/uv/include -I/home/cm/.node-gyp/16.11.1/deps/zlib -I/home/cm/.node-gyp/16.11.1/deps/v8/include -I../src/libsass/include  -fPIC -pthread -Wall -Wextra -Wno-unused-parameter -m64 -O3 -fno-omit-frame-pointer -std=gnu++14 -std=c++0x -fexceptions -frtti -MMD -MF ./Release/.deps/Release/obj.target/libsass/src/libsass/src/source_map.o.d.raw   -c -o Release/obj.target/libsass/src/libsass/src/source_map.o ../src/libsass/src/source_map.cpp
npm ERR!   g++ '-DNODE_GYP_MODULE_NAME=libsass' '-DUSING_UV_SHARED=1' '-DUSING_V8_SHARED=1' '-DV8_DEPRECATION_WARNINGS=1' '-DV8_DEPRECATION_WARNINGS' '-DV8_IMMINENT_DEPRECATION_WARNINGS' '-D_GLIBCXX_USE_CXX11_ABI=1' '-D_LARGEFILE_SOURCE' '-D_FILE_OFFSET_BITS=64' '-D__STDC_FORMAT_MACROS' '-DLIBSASS_VERSION="3.5.5"' -I/home/cm/.node-gyp/16.11.1/include/node -I/home/cm/.node-gyp/16.11.1/src -I/home/cm/.node-gyp/16.11.1/deps/openssl/config -I/home/cm/.node-gyp/16.11.1/deps/openssl/openssl/include -I/home/cm/.node-gyp/16.11.1/deps/uv/include -I/home/cm/.node-gyp/16.11.1/deps/zlib -I/home/cm/.node-gyp/16.11.1/deps/v8/include -I../src/libsass/include  -fPIC -pthread -Wall -Wextra -Wno-unused-parameter -m64 -O3 -fno-omit-frame-pointer -std=gnu++14 -std=c++0x -fexceptions -frtti -MMD -MF ./Release/.deps/Release/obj.target/libsass/src/libsass/src/subset_map.o.d.raw   -c -o Release/obj.target/libsass/src/libsass/src/subset_map.o ../src/libsass/src/subset_map.cpp
npm ERR!   g++ '-DNODE_GYP_MODULE_NAME=libsass' '-DUSING_UV_SHARED=1' '-DUSING_V8_SHARED=1' '-DV8_DEPRECATION_WARNINGS=1' '-DV8_DEPRECATION_WARNINGS' '-DV8_IMMINENT_DEPRECATION_WARNINGS' '-D_GLIBCXX_USE_CXX11_ABI=1' '-D_LARGEFILE_SOURCE' '-D_FILE_OFFSET_BITS=64' '-D__STDC_FORMAT_MACROS' '-DLIBSASS_VERSION="3.5.5"' -I/home/cm/.node-gyp/16.11.1/include/node -I/home/cm/.node-gyp/16.11.1/src -I/home/cm/.node-gyp/16.11.1/deps/openssl/config -I/home/cm/.node-gyp/16.11.1/deps/openssl/openssl/include -I/home/cm/.node-gyp/16.11.1/deps/uv/include -I/home/cm/.node-gyp/16.11.1/deps/zlib -I/home/cm/.node-gyp/16.11.1/deps/v8/include -I../src/libsass/include  -fPIC -pthread -Wall -Wextra -Wno-unused-parameter -m64 -O3 -fno-omit-frame-pointer -std=gnu++14 -std=c++0x -fexceptions -frtti -MMD -MF ./Release/.deps/Release/obj.target/libsass/src/libsass/src/to_c.o.d.raw   -c -o Release/obj.target/libsass/src/libsass/src/to_c.o ../src/libsass/src/to_c.cpp
npm ERR!   g++ '-DNODE_GYP_MODULE_NAME=libsass' '-DUSING_UV_SHARED=1' '-DUSING_V8_SHARED=1' '-DV8_DEPRECATION_WARNINGS=1' '-DV8_DEPRECATION_WARNINGS' '-DV8_IMMINENT_DEPRECATION_WARNINGS' '-D_GLIBCXX_USE_CXX11_ABI=1' '-D_LARGEFILE_SOURCE' '-D_FILE_OFFSET_BITS=64' '-D__STDC_FORMAT_MACROS' '-DLIBSASS_VERSION="3.5.5"' -I/home/cm/.node-gyp/16.11.1/include/node -I/home/cm/.node-gyp/16.11.1/src -I/home/cm/.node-gyp/16.11.1/deps/openssl/config -I/home/cm/.node-gyp/16.11.1/deps/openssl/openssl/include -I/home/cm/.node-gyp/16.11.1/deps/uv/include -I/home/cm/.node-gyp/16.11.1/deps/zlib -I/home/cm/.node-gyp/16.11.1/deps/v8/include -I../src/libsass/include  -fPIC -pthread -Wall -Wextra -Wno-unused-parameter -m64 -O3 -fno-omit-frame-pointer -std=gnu++14 -std=c++0x -fexceptions -frtti -MMD -MF ./Release/.deps/Release/obj.target/libsass/src/libsass/src/to_value.o.d.raw   -c -o Release/obj.target/libsass/src/libsass/src/to_value.o ../src/libsass/src/to_value.cpp
npm ERR!   g++ '-DNODE_GYP_MODULE_NAME=libsass' '-DUSING_UV_SHARED=1' '-DUSING_V8_SHARED=1' '-DV8_DEPRECATION_WARNINGS=1' '-DV8_DEPRECATION_WARNINGS' '-DV8_IMMINENT_DEPRECATION_WARNINGS' '-D_GLIBCXX_USE_CXX11_ABI=1' '-D_LARGEFILE_SOURCE' '-D_FILE_OFFSET_BITS=64' '-D__STDC_FORMAT_MACROS' '-DLIBSASS_VERSION="3.5.5"' -I/home/cm/.node-gyp/16.11.1/include/node -I/home/cm/.node-gyp/16.11.1/src -I/home/cm/.node-gyp/16.11.1/deps/openssl/config -I/home/cm/.node-gyp/16.11.1/deps/openssl/openssl/include -I/home/cm/.node-gyp/16.11.1/deps/uv/include -I/home/cm/.node-gyp/16.11.1/deps/zlib -I/home/cm/.node-gyp/16.11.1/deps/v8/include -I../src/libsass/include  -fPIC -pthread -Wall -Wextra -Wno-unused-parameter -m64 -O3 -fno-omit-frame-pointer -std=gnu++14 -std=c++0x -fexceptions -frtti -MMD -MF ./Release/.deps/Release/obj.target/libsass/src/libsass/src/units.o.d.raw   -c -o Release/obj.target/libsass/src/libsass/src/units.o ../src/libsass/src/units.cpp
npm ERR!   g++ '-DNODE_GYP_MODULE_NAME=libsass' '-DUSING_UV_SHARED=1' '-DUSING_V8_SHARED=1' '-DV8_DEPRECATION_WARNINGS=1' '-DV8_DEPRECATION_WARNINGS' '-DV8_IMMINENT_DEPRECATION_WARNINGS' '-D_GLIBCXX_USE_CXX11_ABI=1' '-D_LARGEFILE_SOURCE' '-D_FILE_OFFSET_BITS=64' '-D__STDC_FORMAT_MACROS' '-DLIBSASS_VERSION="3.5.5"' -I/home/cm/.node-gyp/16.11.1/include/node -I/home/cm/.node-gyp/16.11.1/src -I/home/cm/.node-gyp/16.11.1/deps/openssl/config -I/home/cm/.node-gyp/16.11.1/deps/openssl/openssl/include -I/home/cm/.node-gyp/16.11.1/deps/uv/include -I/home/cm/.node-gyp/16.11.1/deps/zlib -I/home/cm/.node-gyp/16.11.1/deps/v8/include -I../src/libsass/include  -fPIC -pthread -Wall -Wextra -Wno-unused-parameter -m64 -O3 -fno-omit-frame-pointer -std=gnu++14 -std=c++0x -fexceptions -frtti -MMD -MF ./Release/.deps/Release/obj.target/libsass/src/libsass/src/utf8_string.o.d.raw   -c -o Release/obj.target/libsass/src/libsass/src/utf8_string.o ../src/libsass/src/utf8_string.cpp
npm ERR!   g++ '-DNODE_GYP_MODULE_NAME=libsass' '-DUSING_UV_SHARED=1' '-DUSING_V8_SHARED=1' '-DV8_DEPRECATION_WARNINGS=1' '-DV8_DEPRECATION_WARNINGS' '-DV8_IMMINENT_DEPRECATION_WARNINGS' '-D_GLIBCXX_USE_CXX11_ABI=1' '-D_LARGEFILE_SOURCE' '-D_FILE_OFFSET_BITS=64' '-D__STDC_FORMAT_MACROS' '-DLIBSASS_VERSION="3.5.5"' -I/home/cm/.node-gyp/16.11.1/include/node -I/home/cm/.node-gyp/16.11.1/src -I/home/cm/.node-gyp/16.11.1/deps/openssl/config -I/home/cm/.node-gyp/16.11.1/deps/openssl/openssl/include -I/home/cm/.node-gyp/16.11.1/deps/uv/include -I/home/cm/.node-gyp/16.11.1/deps/zlib -I/home/cm/.node-gyp/16.11.1/deps/v8/include -I../src/libsass/include  -fPIC -pthread -Wall -Wextra -Wno-unused-parameter -m64 -O3 -fno-omit-frame-pointer -std=gnu++14 -std=c++0x -fexceptions -frtti -MMD -MF ./Release/.deps/Release/obj.target/libsass/src/libsass/src/util.o.d.raw   -c -o Release/obj.target/libsass/src/libsass/src/util.o ../src/libsass/src/util.cpp
npm ERR!   g++ '-DNODE_GYP_MODULE_NAME=libsass' '-DUSING_UV_SHARED=1' '-DUSING_V8_SHARED=1' '-DV8_DEPRECATION_WARNINGS=1' '-DV8_DEPRECATION_WARNINGS' '-DV8_IMMINENT_DEPRECATION_WARNINGS' '-D_GLIBCXX_USE_CXX11_ABI=1' '-D_LARGEFILE_SOURCE' '-D_FILE_OFFSET_BITS=64' '-D__STDC_FORMAT_MACROS' '-DLIBSASS_VERSION="3.5.5"' -I/home/cm/.node-gyp/16.11.1/include/node -I/home/cm/.node-gyp/16.11.1/src -I/home/cm/.node-gyp/16.11.1/deps/openssl/config -I/home/cm/.node-gyp/16.11.1/deps/openssl/openssl/include -I/home/cm/.node-gyp/16.11.1/deps/uv/include -I/home/cm/.node-gyp/16.11.1/deps/zlib -I/home/cm/.node-gyp/16.11.1/deps/v8/include -I../src/libsass/include  -fPIC -pthread -Wall -Wextra -Wno-unused-parameter -m64 -O3 -fno-omit-frame-pointer -std=gnu++14 -std=c++0x -fexceptions -frtti -MMD -MF ./Release/.deps/Release/obj.target/libsass/src/libsass/src/values.o.d.raw   -c -o Release/obj.target/libsass/src/libsass/src/values.o ../src/libsass/src/values.cpp
npm ERR!   rm -f Release/obj.target/src/sass.a && ar crs Release/obj.target/src/sass.a Release/obj.target/libsass/src/libsass/src/ast.o Release/obj.target/libsass/src/libsass/src/ast_fwd_decl.o Release/obj.target/libsass/src/libsass/src/backtrace.o Release/obj.target/libsass/src/libsass/src/base64vlq.o Release/obj.target/libsass/src/libsass/src/bind.o Release/obj.target/libsass/src/libsass/src/cencode.o Release/obj.target/libsass/src/libsass/src/check_nesting.o Release/obj.target/libsass/src/libsass/src/color_maps.o Release/obj.target/libsass/src/libsass/src/constants.o Release/obj.target/libsass/src/libsass/src/context.o Release/obj.target/libsass/src/libsass/src/cssize.o Release/obj.target/libsass/src/libsass/src/emitter.o Release/obj.target/libsass/src/libsass/src/environment.o Release/obj.target/libsass/src/libsass/src/error_handling.o Release/obj.target/libsass/src/libsass/src/eval.o Release/obj.target/libsass/src/libsass/src/expand.o Release/obj.target/libsass/src/libsass/src/extend.o Release/obj.target/libsass/src/libsass/src/file.o Release/obj.target/libsass/src/libsass/src/functions.o Release/obj.target/libsass/src/libsass/src/inspect.o Release/obj.target/libsass/src/libsass/src/json.o Release/obj.target/libsass/src/libsass/src/lexer.o Release/obj.target/libsass/src/libsass/src/listize.o Release/obj.target/libsass/src/libsass/src/memory/SharedPtr.o Release/obj.target/libsass/src/libsass/src/node.o Release/obj.target/libsass/src/libsass/src/operators.o Release/obj.target/libsass/src/libsass/src/output.o Release/obj.target/libsass/src/libsass/src/parser.o Release/obj.target/libsass/src/libsass/src/plugins.o Release/obj.target/libsass/src/libsass/src/position.o Release/obj.target/libsass/src/libsass/src/prelexer.o Release/obj.target/libsass/src/libsass/src/remove_placeholders.o Release/obj.target/libsass/src/libsass/src/sass.o Release/obj.target/libsass/src/libsass/src/sass2scss.o Release/obj.target/libsass/src/libsass/src/sass_context.o Release/obj.target/libsass/src/libsass/src/sass_functions.o Release/obj.target/libsass/src/libsass/src/sass_util.o Release/obj.target/libsass/src/libsass/src/sass_values.o Release/obj.target/libsass/src/libsass/src/source_map.o Release/obj.target/libsass/src/libsass/src/subset_map.o Release/obj.target/libsass/src/libsass/src/to_c.o Release/obj.target/libsass/src/libsass/src/to_value.o Release/obj.target/libsass/src/libsass/src/units.o Release/obj.target/libsass/src/libsass/src/utf8_string.o Release/obj.target/libsass/src/libsass/src/util.o Release/obj.target/libsass/src/libsass/src/values.o
npm ERR!   rm -rf "Release/sass.a" && cp -af "Release/obj.target/src/sass.a" "Release/sass.a"
npm ERR!   g++ '-DNODE_GYP_MODULE_NAME=binding' '-DUSING_UV_SHARED=1' '-DUSING_V8_SHARED=1' '-DV8_DEPRECATION_WARNINGS=1' '-DV8_DEPRECATION_WARNINGS' '-DV8_IMMINENT_DEPRECATION_WARNINGS' '-D_GLIBCXX_USE_CXX11_ABI=1' '-D_LARGEFILE_SOURCE' '-D_FILE_OFFSET_BITS=64' '-D__STDC_FORMAT_MACROS' '-DBUILDING_NODE_EXTENSION' -I/home/cm/.node-gyp/16.11.1/include/node -I/home/cm/.node-gyp/16.11.1/src -I/home/cm/.node-gyp/16.11.1/deps/openssl/config -I/home/cm/.node-gyp/16.11.1/deps/openssl/openssl/include -I/home/cm/.node-gyp/16.11.1/deps/uv/include -I/home/cm/.node-gyp/16.11.1/deps/zlib -I/home/cm/.node-gyp/16.11.1/deps/v8/include -I../../nan -I../src/libsass/include  -fPIC -pthread -Wall -Wextra -Wno-unused-parameter -m64 -O3 -fno-omit-frame-pointer -fno-rtti -fno-exceptions -std=gnu++14 -std=c++0x -MMD -MF ./Release/.deps/Release/obj.target/binding/src/binding.o.d.raw   -c -o Release/obj.target/binding/src/binding.o ../src/binding.cpp
npm ERR! make: 离开目录“/it/www/vue/node_modules/node-sass/build”
npm ERR! gyp info it worked if it ends with ok
npm ERR! gyp verb cli [
npm ERR! gyp verb cli   '/usr/bin/node',
npm ERR! gyp verb cli   '/it/www/vue/node_modules/.bin/node-gyp',
npm ERR! gyp verb cli   'rebuild'
npm ERR! gyp verb cli ]
npm ERR! gyp info using node-gyp@3.8.0
npm ERR! gyp info using node@16.11.1 | linux | x64
npm ERR! gyp verb command rebuild []
npm ERR! gyp verb command clean []
npm ERR! gyp verb clean removing "build" directory
npm ERR! gyp verb command configure []
npm ERR! gyp verb check python checking for Python executable "python2" in the PATH
npm ERR! gyp verb `which` succeeded python2 /usr/bin/python2
npm ERR! gyp verb check python version `/usr/bin/python2 -c "import sys; print "2.7.18
npm ERR! gyp verb check python version .%s.%s" % sys.version_info[:3];"` returned: %j
npm ERR! gyp verb get node dir no --target version specified, falling back to host node version: 16.11.1
npm ERR! gyp verb command install [ '16.11.1' ]
npm ERR! gyp verb install input version string "16.11.1"
npm ERR! gyp verb install installing version: 16.11.1
npm ERR! gyp verb install --ensure was passed, so won't reinstall if already installed
npm ERR! gyp verb install version is already installed, need to check "installVersion"
npm ERR! gyp verb got "installVersion" 9
npm ERR! gyp verb needs "installVersion" 9
npm ERR! gyp verb install version is good
npm ERR! gyp verb get node dir target node version installed: 16.11.1
npm ERR! gyp verb build dir attempting to create "build" dir: /it/www/vue/node_modules/node-sass/build
npm ERR! gyp verb build dir "build" dir needed to be created? /it/www/vue/node_modules/node-sass/build
npm ERR! gyp verb build/config.gypi creating config file
npm ERR! gyp verb build/config.gypi writing out config file: /it/www/vue/node_modules/node-sass/build/config.gypi
npm ERR! (node:401316) [DEP0150] DeprecationWarning: Setting process.config is deprecated. In the future the property will be read-only.
npm ERR! (Use `node --trace-deprecation ...` to show where the warning was created)
npm ERR! gyp verb config.gypi checking for gypi file: /it/www/vue/node_modules/node-sass/config.gypi
npm ERR! gyp verb common.gypi checking for gypi file: /it/www/vue/node_modules/node-sass/common.gypi
npm ERR! gyp verb gyp gyp format was not specified; forcing "make"
npm ERR! gyp info spawn /usr/bin/python2
npm ERR! gyp info spawn args [
npm ERR! gyp info spawn args   '/it/www/vue/node_modules/node-gyp/gyp/gyp_main.py',
npm ERR! gyp info spawn args   'binding.gyp',
npm ERR! gyp info spawn args   '-f',
npm ERR! gyp info spawn args   'make',
npm ERR! gyp info spawn args   '-I',
npm ERR! gyp info spawn args   '/it/www/vue/node_modules/node-sass/build/config.gypi',
npm ERR! gyp info spawn args   '-I',
npm ERR! gyp info spawn args   '/it/www/vue/node_modules/node-gyp/addon.gypi',
npm ERR! gyp info spawn args   '-I',
npm ERR! gyp info spawn args   '/home/cm/.node-gyp/16.11.1/include/node/common.gypi',
npm ERR! gyp info spawn args   '-Dlibrary=shared_library',
npm ERR! gyp info spawn args   '-Dvisibility=default',
npm ERR! gyp info spawn args   '-Dnode_root_dir=/home/cm/.node-gyp/16.11.1',
npm ERR! gyp info spawn args   '-Dnode_gyp_dir=/it/www/vue/node_modules/node-gyp',
npm ERR! gyp info spawn args   '-Dnode_lib_file=/home/cm/.node-gyp/16.11.1/<(target_arch)/node.lib',
npm ERR! gyp info spawn args   '-Dmodule_root_dir=/it/www/vue/node_modules/node-sass',
npm ERR! gyp info spawn args   '-Dnode_engine=v8',
npm ERR! gyp info spawn args   '--depth=.',
npm ERR! gyp info spawn args   '--no-parallel',
npm ERR! gyp info spawn args   '--generator-output',
npm ERR! gyp info spawn args   'build',
npm ERR! gyp info spawn args   '-Goutput_dir=.'
npm ERR! gyp info spawn args ]
npm ERR! gyp verb command build []
npm ERR! gyp verb build type Release
npm ERR! gyp verb architecture x64
npm ERR! gyp verb node dev dir /home/cm/.node-gyp/16.11.1
npm ERR! gyp verb `which` succeeded for `make` /usr/bin/make
npm ERR! gyp info spawn make
npm ERR! gyp info spawn args [ 'V=1', 'BUILDTYPE=Release', '-C', 'build' ]
npm ERR! In file included from ../src/libsass/src/ast.cpp:2:
npm ERR! ../src/libsass/src/ast.hpp: 在成员函数‘virtual size_t Sass::Number::hash()’中:
npm ERR! ../src/libsass/src/ast.hpp:1614:25: 警告:loop variable ‘numerator’ creates a copy from type ‘const std::__cxx11::basic_string<char>’ [-Wrange-loop-construct]
npm ERR!  1614 |         for (const auto numerator : numerators)
npm ERR!       |                         ^~~~~~~~~
npm ERR! ../src/libsass/src/ast.hpp:1614:25: 附注:use reference type to prevent copying
npm ERR!  1614 |         for (const auto numerator : numerators)
npm ERR!       |                         ^~~~~~~~~
npm ERR!       |                         &
npm ERR! ../src/libsass/src/ast.hpp:1616:25: 警告:loop variable ‘denominator’ creates a copy from type ‘const std::__cxx11::basic_string<char>’ [-Wrange-loop-construct]
npm ERR!  1616 |         for (const auto denominator : denominators)
npm ERR!       |                         ^~~~~~~~~~~
npm ERR! ../src/libsass/src/ast.hpp:1616:25: 附注:use reference type to prevent copying
npm ERR!  1616 |         for (const auto denominator : denominators)
npm ERR!       |                         ^~~~~~~~~~~
npm ERR!       |                         &
npm ERR! In file included from ../src/libsass/src/ast_fwd_decl.cpp:1:
npm ERR! ../src/libsass/src/ast.hpp: 在成员函数‘virtual size_t Sass::Number::hash()’中:
npm ERR! ../src/libsass/src/ast.hpp:1614:25: 警告:loop variable ‘numerator’ creates a copy from type ‘const std::__cxx11::basic_string<char>’ [-Wrange-loop-construct]
npm ERR!  1614 |         for (const auto numerator : numerators)
npm ERR!       |                         ^~~~~~~~~
npm ERR! ../src/libsass/src/ast.hpp:1614:25: 附注:use reference type to prevent copying
npm ERR!  1614 |         for (const auto numerator : numerators)
npm ERR!       |                         ^~~~~~~~~
npm ERR!       |                         &
npm ERR! ../src/libsass/src/ast.hpp:1616:25: 警告:loop variable ‘denominator’ creates a copy from type ‘const std::__cxx11::basic_string<char>’ [-Wrange-loop-construct]
npm ERR!  1616 |         for (const auto denominator : denominators)
npm ERR!       |                         ^~~~~~~~~~~
npm ERR! ../src/libsass/src/ast.hpp:1616:25: 附注:use reference type to prevent copying
npm ERR!  1616 |         for (const auto denominator : denominators)
npm ERR!       |                         ^~~~~~~~~~~
npm ERR!       |                         &
npm ERR! In file included from ../src/libsass/src/bind.cpp:3:
npm ERR! ../src/libsass/src/ast.hpp: 在成员函数‘virtual size_t Sass::Number::hash()’中:
npm ERR! ../src/libsass/src/ast.hpp:1614:25: 警告:loop variable ‘numerator’ creates a copy from type ‘const std::__cxx11::basic_string<char>’ [-Wrange-loop-construct]
npm ERR!  1614 |         for (const auto numerator : numerators)
npm ERR!       |                         ^~~~~~~~~
npm ERR! ../src/libsass/src/ast.hpp:1614:25: 附注:use reference type to prevent copying
npm ERR!  1614 |         for (const auto numerator : numerators)
npm ERR!       |                         ^~~~~~~~~
npm ERR!       |                         &
npm ERR! ../src/libsass/src/ast.hpp:1616:25: 警告:loop variable ‘denominator’ creates a copy from type ‘const std::__cxx11::basic_string<char>’ [-Wrange-loop-construct]
npm ERR!  1616 |         for (const auto denominator : denominators)
npm ERR!       |                         ^~~~~~~~~~~
npm ERR! ../src/libsass/src/ast.hpp:1616:25: 附注:use reference type to prevent copying
npm ERR!  1616 |         for (const auto denominator : denominators)
npm ERR!       |                         ^~~~~~~~~~~
npm ERR!       |                         &
npm ERR! ../src/libsass/src/cencode.c: 在函数‘base64_encode_block’中:
npm ERR! ../src/libsass/src/cencode.c:48:32: 警告:this statement may fall through [-Wimplicit-fallthrough=]
npm ERR!    48 |                         result = (fragment & 0x003) << 4;
npm ERR!       |                         ~~~~~~~^~~~~~~~~~~~~~~~~~~~~~~~~
npm ERR! ../src/libsass/src/cencode.c:52:9: 附注:here
npm ERR!    52 |         case step_B:
npm ERR!       |         ^~~~
npm ERR! ../src/libsass/src/cencode.c:62:32: 警告:this statement may fall through [-Wimplicit-fallthrough=]
npm ERR!    62 |                         result = (fragment & 0x00f) << 2;
npm ERR!       |                         ~~~~~~~^~~~~~~~~~~~~~~~~~~~~~~~~
npm ERR! ../src/libsass/src/cencode.c:66:9: 附注:here
npm ERR!    66 |         case step_C:
npm ERR!       |         ^~~~
npm ERR! In file included from ../src/libsass/src/check_nesting.hpp:4,
npm ERR!                  from ../src/libsass/src/check_nesting.cpp:4:
npm ERR! ../src/libsass/src/ast.hpp: 在成员函数‘virtual size_t Sass::Number::hash()’中:
npm ERR! ../src/libsass/src/ast.hpp:1614:25: 警告:loop variable ‘numerator’ creates a copy from type ‘const std::__cxx11::basic_string<char>’ [-Wrange-loop-construct]
npm ERR!  1614 |         for (const auto numerator : numerators)
npm ERR!       |                         ^~~~~~~~~
npm ERR! ../src/libsass/src/ast.hpp:1614:25: 附注:use reference type to prevent copying
npm ERR!  1614 |         for (const auto numerator : numerators)
npm ERR!       |                         ^~~~~~~~~
npm ERR!       |                         &
npm ERR! ../src/libsass/src/ast.hpp:1616:25: 警告:loop variable ‘denominator’ creates a copy from type ‘const std::__cxx11::basic_string<char>’ [-Wrange-loop-construct]
npm ERR!  1616 |         for (const auto denominator : denominators)
npm ERR!       |                         ^~~~~~~~~~~
npm ERR! ../src/libsass/src/ast.hpp:1616:25: 附注:use reference type to prevent copying
npm ERR!  1616 |         for (const auto denominator : denominators)
npm ERR!       |                         ^~~~~~~~~~~
npm ERR!       |                         &
npm ERR! In file included from ../src/libsass/src/color_maps.cpp:2:
npm ERR! ../src/libsass/src/ast.hpp: 在成员函数‘virtual size_t Sass::Number::hash()’中:
npm ERR! ../src/libsass/src/ast.hpp:1614:25: 警告:loop variable ‘numerator’ creates a copy from type ‘const std::__cxx11::basic_string<char>’ [-Wrange-loop-construct]
npm ERR!  1614 |         for (const auto numerator : numerators)
npm ERR!       |                         ^~~~~~~~~
npm ERR! ../src/libsass/src/ast.hpp:1614:25: 附注:use reference type to prevent copying
npm ERR!  1614 |         for (const auto numerator : numerators)
npm ERR!       |                         ^~~~~~~~~
npm ERR!       |                         &
npm ERR! ../src/libsass/src/ast.hpp:1616:25: 警告:loop variable ‘denominator’ creates a copy from type ‘const std::__cxx11::basic_string<char>’ [-Wrange-loop-construct]
npm ERR!  1616 |         for (const auto denominator : denominators)
npm ERR!       |                         ^~~~~~~~~~~
npm ERR! ../src/libsass/src/ast.hpp:1616:25: 附注:use reference type to prevent copying
npm ERR!  1616 |         for (const auto denominator : denominators)
npm ERR!       |                         ^~~~~~~~~~~
npm ERR!       |                         &
npm ERR! In file included from ../src/libsass/src/context.cpp:9:
npm ERR! ../src/libsass/src/ast.hpp: 在成员函数‘virtual size_t Sass::Number::hash()’中:
npm ERR! ../src/libsass/src/ast.hpp:1614:25: 警告:loop variable ‘numerator’ creates a copy from type ‘const std::__cxx11::basic_string<char>’ [-Wrange-loop-construct]
npm ERR!  1614 |         for (const auto numerator : numerators)
npm ERR!       |                         ^~~~~~~~~
npm ERR! ../src/libsass/src/ast.hpp:1614:25: 附注:use reference type to prevent copying
npm ERR!  1614 |         for (const auto numerator : numerators)
npm ERR!       |                         ^~~~~~~~~
npm ERR!       |                         &
npm ERR! ../src/libsass/src/ast.hpp:1616:25: 警告:loop variable ‘denominator’ creates a copy from type ‘const std::__cxx11::basic_string<char>’ [-Wrange-loop-construct]
npm ERR!  1616 |         for (const auto denominator : denominators)
npm ERR!       |                         ^~~~~~~~~~~
npm ERR! ../src/libsass/src/ast.hpp:1616:25: 附注:use reference type to prevent copying
npm ERR!  1616 |         for (const auto denominator : denominators)
npm ERR!       |                         ^~~~~~~~~~~
npm ERR!       |                         &
npm ERR! In file included from ../src/libsass/src/cssize.hpp:4,
npm ERR!                  from ../src/libsass/src/cssize.cpp:6:
npm ERR! ../src/libsass/src/ast.hpp: 在成员函数‘virtual size_t Sass::Number::hash()’中:
npm ERR! ../src/libsass/src/ast.hpp:1614:25: 警告:loop variable ‘numerator’ creates a copy from type ‘const std::__cxx11::basic_string<char>’ [-Wrange-loop-construct]
npm ERR!  1614 |         for (const auto numerator : numerators)
npm ERR!       |                         ^~~~~~~~~
npm ERR! ../src/libsass/src/ast.hpp:1614:25: 附注:use reference type to prevent copying
npm ERR!  1614 |         for (const auto numerator : numerators)
npm ERR!       |                         ^~~~~~~~~
npm ERR!       |                         &
npm ERR! ../src/libsass/src/ast.hpp:1616:25: 警告:loop variable ‘denominator’ creates a copy from type ‘const std::__cxx11::basic_string<char>’ [-Wrange-loop-construct]
npm ERR!  1616 |         for (const auto denominator : denominators)
npm ERR!       |                         ^~~~~~~~~~~
npm ERR! ../src/libsass/src/ast.hpp:1616:25: 附注:use reference type to prevent copying
npm ERR!  1616 |         for (const auto denominator : denominators)
npm ERR!       |                         ^~~~~~~~~~~
npm ERR!       |                         &
npm ERR! In file included from ../src/libsass/src/environment.cpp:2:
npm ERR! ../src/libsass/src/ast.hpp: 在成员函数‘virtual size_t Sass::Number::hash()’中:
npm ERR! ../src/libsass/src/ast.hpp:1614:25: 警告:loop variable ‘numerator’ creates a copy from type ‘const std::__cxx11::basic_string<char>’ [-Wrange-loop-construct]
npm ERR!  1614 |         for (const auto numerator : numerators)
npm ERR!       |                         ^~~~~~~~~
npm ERR! ../src/libsass/src/ast.hpp:1614:25: 附注:use reference type to prevent copying
npm ERR!  1614 |         for (const auto numerator : numerators)
npm ERR!       |                         ^~~~~~~~~
npm ERR!       |                         &
npm ERR! ../src/libsass/src/ast.hpp:1616:25: 警告:loop variable ‘denominator’ creates a copy from type ‘const std::__cxx11::basic_string<char>’ [-Wrange-loop-construct]
npm ERR!  1616 |         for (const auto denominator : denominators)
npm ERR!       |                         ^~~~~~~~~~~
npm ERR! ../src/libsass/src/ast.hpp:1616:25: 附注:use reference type to prevent copying
npm ERR!  1616 |         for (const auto denominator : denominators)
npm ERR!       |                         ^~~~~~~~~~~
npm ERR!       |                         &
npm ERR! In file included from ../src/libsass/src/error_handling.cpp:2:
npm ERR! ../src/libsass/src/ast.hpp: 在成员函数‘virtual size_t Sass::Number::hash()’中:
npm ERR! ../src/libsass/src/ast.hpp:1614:25: 警告:loop variable ‘numerator’ creates a copy from type ‘const std::__cxx11::basic_string<char>’ [-Wrange-loop-construct]
npm ERR!  1614 |         for (const auto numerator : numerators)
npm ERR!       |                         ^~~~~~~~~
npm ERR! ../src/libsass/src/ast.hpp:1614:25: 附注:use reference type to prevent copying
npm ERR!  1614 |         for (const auto numerator : numerators)
npm ERR!       |                         ^~~~~~~~~
npm ERR!       |                         &
npm ERR! ../src/libsass/src/ast.hpp:1616:25: 警告:loop variable ‘denominator’ creates a copy from type ‘const std::__cxx11::basic_string<char>’ [-Wrange-loop-construct]
npm ERR!  1616 |         for (const auto denominator : denominators)
npm ERR!       |                         ^~~~~~~~~~~
npm ERR! ../src/libsass/src/ast.hpp:1616:25: 附注:use reference type to prevent copying
npm ERR!  1616 |         for (const auto denominator : denominators)
npm ERR!       |                         ^~~~~~~~~~~
npm ERR!       |                         &
npm ERR! In file included from ../src/libsass/src/eval.hpp:4,
npm ERR!                  from ../src/libsass/src/eval.cpp:10:
npm ERR! ../src/libsass/src/ast.hpp: 在成员函数‘virtual size_t Sass::Number::hash()’中:
npm ERR! ../src/libsass/src/ast.hpp:1614:25: 警告:loop variable ‘numerator’ creates a copy from type ‘const std::__cxx11::basic_string<char>’ [-Wrange-loop-construct]
npm ERR!  1614 |         for (const auto numerator : numerators)
npm ERR!       |                         ^~~~~~~~~
npm ERR! ../src/libsass/src/ast.hpp:1614:25: 附注:use reference type to prevent copying
npm ERR!  1614 |         for (const auto numerator : numerators)
npm ERR!       |                         ^~~~~~~~~
npm ERR!       |                         &
npm ERR! ../src/libsass/src/ast.hpp:1616:25: 警告:loop variable ‘denominator’ creates a copy from type ‘const std::__cxx11::basic_string<char>’ [-Wrange-loop-construct]
npm ERR!  1616 |         for (const auto denominator : denominators)
npm ERR!       |                         ^~~~~~~~~~~
npm ERR! ../src/libsass/src/ast.hpp:1616:25: 附注:use reference type to prevent copying
npm ERR!  1616 |         for (const auto denominator : denominators)
npm ERR!       |                         ^~~~~~~~~~~
npm ERR!       |                         &
npm ERR! In file included from ../src/libsass/src/expand.cpp:5:
npm ERR! ../src/libsass/src/ast.hpp: 在成员函数‘virtual size_t Sass::Number::hash()’中:
npm ERR! ../src/libsass/src/ast.hpp:1614:25: 警告:loop variable ‘numerator’ creates a copy from type ‘const std::__cxx11::basic_string<char>’ [-Wrange-loop-construct]
npm ERR!  1614 |         for (const auto numerator : numerators)
npm ERR!       |                         ^~~~~~~~~
npm ERR! ../src/libsass/src/ast.hpp:1614:25: 附注:use reference type to prevent copying
npm ERR!  1614 |         for (const auto numerator : numerators)
npm ERR!       |                         ^~~~~~~~~
npm ERR!       |                         &
npm ERR! ../src/libsass/src/ast.hpp:1616:25: 警告:loop variable ‘denominator’ creates a copy from type ‘const std::__cxx11::basic_string<char>’ [-Wrange-loop-construct]
npm ERR!  1616 |         for (const auto denominator : denominators)
npm ERR!       |                         ^~~~~~~~~~~
npm ERR! ../src/libsass/src/ast.hpp:1616:25: 附注:use reference type to prevent copying
npm ERR!  1616 |         for (const auto denominator : denominators)
npm ERR!       |                         ^~~~~~~~~~~
npm ERR!       |                         &
npm ERR! In file included from ../src/libsass/src/extend.hpp:7,
npm ERR!                  from ../src/libsass/src/extend.cpp:2:
npm ERR! ../src/libsass/src/ast.hpp: 在成员函数‘virtual size_t Sass::Number::hash()’中:
npm ERR! ../src/libsass/src/ast.hpp:1614:25: 警告:loop variable ‘numerator’ creates a copy from type ‘const std::__cxx11::basic_string<char>’ [-Wrange-loop-construct]
npm ERR!  1614 |         for (const auto numerator : numerators)
npm ERR!       |                         ^~~~~~~~~
npm ERR! ../src/libsass/src/ast.hpp:1614:25: 附注:use reference type to prevent copying
npm ERR!  1614 |         for (const auto numerator : numerators)
npm ERR!       |                         ^~~~~~~~~
npm ERR!       |                         &
npm ERR! ../src/libsass/src/ast.hpp:1616:25: 警告:loop variable ‘denominator’ creates a copy from type ‘const std::__cxx11::basic_string<char>’ [-Wrange-loop-construct]
npm ERR!  1616 |         for (const auto denominator : denominators)
npm ERR!       |                         ^~~~~~~~~~~
npm ERR! ../src/libsass/src/ast.hpp:1616:25: 附注:use reference type to prevent copying
npm ERR!  1616 |         for (const auto denominator : denominators)
npm ERR!       |                         ^~~~~~~~~~~
npm ERR!       |                         &
npm ERR! In file included from ../src/libsass/src/listize.hpp:7,
npm ERR!                  from ../src/libsass/src/functions.hpp:4,
npm ERR!                  from ../src/libsass/src/sass_functions.hpp:6,
npm ERR!                  from ../src/libsass/src/file.cpp:23:
npm ERR! ../src/libsass/src/ast.hpp: 在成员函数‘virtual size_t Sass::Number::hash()’中:
npm ERR! ../src/libsass/src/ast.hpp:1614:25: 警告:loop variable ‘numerator’ creates a copy from type ‘const std::__cxx11::basic_string<char>’ [-Wrange-loop-construct]
npm ERR!  1614 |         for (const auto numerator : numerators)
npm ERR!       |                         ^~~~~~~~~
npm ERR! ../src/libsass/src/ast.hpp:1614:25: 附注:use reference type to prevent copying
npm ERR!  1614 |         for (const auto numerator : numerators)
npm ERR!       |                         ^~~~~~~~~
npm ERR!       |                         &
npm ERR! ../src/libsass/src/ast.hpp:1616:25: 警告:loop variable ‘denominator’ creates a copy from type ‘const std::__cxx11::basic_string<char>’ [-Wrange-loop-construct]
npm ERR!  1616 |         for (const auto denominator : denominators)
npm ERR!       |                         ^~~~~~~~~~~
npm ERR! ../src/libsass/src/ast.hpp:1616:25: 附注:use reference type to prevent copying
npm ERR!  1616 |         for (const auto denominator : denominators)
npm ERR!       |                         ^~~~~~~~~~~
npm ERR!       |                         &
npm ERR! In file included from ../src/libsass/src/listize.hpp:7,
npm ERR!                  from ../src/libsass/src/functions.hpp:4,
npm ERR!                  from ../src/libsass/src/functions.cpp:2:
npm ERR! ../src/libsass/src/ast.hpp: 在成员函数‘virtual size_t Sass::Number::hash()’中:
npm ERR! ../src/libsass/src/ast.hpp:1614:25: 警告:loop variable ‘numerator’ creates a copy from type ‘const std::__cxx11::basic_string<char>’ [-Wrange-loop-construct]
npm ERR!  1614 |         for (const auto numerator : numerators)
npm ERR!       |                         ^~~~~~~~~
npm ERR! ../src/libsass/src/ast.hpp:1614:25: 附注:use reference type to prevent copying
npm ERR!  1614 |         for (const auto numerator : numerators)
npm ERR!       |                         ^~~~~~~~~
npm ERR!       |                         &
npm ERR! ../src/libsass/src/ast.hpp:1616:25: 警告:loop variable ‘denominator’ creates a copy from type ‘const std::__cxx11::basic_string<char>’ [-Wrange-loop-construct]
npm ERR!  1616 |         for (const auto denominator : denominators)
npm ERR!       |                         ^~~~~~~~~~~
npm ERR! ../src/libsass/src/ast.hpp:1616:25: 附注:use reference type to prevent copying
npm ERR!  1616 |         for (const auto denominator : denominators)
npm ERR!       |                         ^~~~~~~~~~~
npm ERR!       |                         &
npm ERR! ../src/libsass/src/functions.cpp: 在函数‘void Sass::Functions::handle_utf8_error(const Sass::ParserState&, Sass::Backtraces)’中:
npm ERR! ../src/libsass/src/functions.cpp:110:20: 警告:catching polymorphic type ‘class utf8::invalid_code_point’ by value [-Wcatch-value=]
npm ERR!   110 |       catch (utf8::invalid_code_point) {
npm ERR!       |                    ^~~~~~~~~~~~~~~~~~
npm ERR! ../src/libsass/src/functions.cpp:114:20: 警告:catching polymorphic type ‘class utf8::not_enough_room’ by value [-Wcatch-value=]
npm ERR!   114 |       catch (utf8::not_enough_room) {
npm ERR!       |                    ^~~~~~~~~~~~~~~
npm ERR! ../src/libsass/src/functions.cpp:118:20: 警告:catching polymorphic type ‘class utf8::invalid_utf8’ by value [-Wcatch-value=]
npm ERR!   118 |       catch (utf8::invalid_utf8) {
npm ERR!       |                    ^~~~~~~~~~~~
npm ERR! In file included from ../src/libsass/src/inspect.cpp:9:
npm ERR! ../src/libsass/src/ast.hpp: 在成员函数‘virtual size_t Sass::Number::hash()’中:
npm ERR! ../src/libsass/src/ast.hpp:1614:25: 警告:loop variable ‘numerator’ creates a copy from type ‘const std::__cxx11::basic_string<char>’ [-Wrange-loop-construct]
npm ERR!  1614 |         for (const auto numerator : numerators)
npm ERR!       |                         ^~~~~~~~~
npm ERR! ../src/libsass/src/ast.hpp:1614:25: 附注:use reference type to prevent copying
npm ERR!  1614 |         for (const auto numerator : numerators)
npm ERR!       |                         ^~~~~~~~~
npm ERR!       |                         &
npm ERR! ../src/libsass/src/ast.hpp:1616:25: 警告:loop variable ‘denominator’ creates a copy from type ‘const std::__cxx11::basic_string<char>’ [-Wrange-loop-construct]
npm ERR!  1616 |         for (const auto denominator : denominators)
npm ERR!       |                         ^~~~~~~~~~~
npm ERR! ../src/libsass/src/ast.hpp:1616:25: 附注:use reference type to prevent copying
npm ERR!  1616 |         for (const auto denominator : denominators)
npm ERR!       |                         ^~~~~~~~~~~
npm ERR!       |                         &
npm ERR! ../src/libsass/src/json.cpp: 在函数‘char* json_encode_string(const char*)’中:
npm ERR! ../src/libsass/src/json.cpp:405:15: 警告:catching polymorphic type ‘class std::exception’ by value [-Wcatch-value=]
npm ERR!   405 |   catch (std::exception) {
npm ERR!       |               ^~~~~~~~~
npm ERR! ../src/libsass/src/json.cpp: 在函数‘char* json_stringify(const JsonNode*, const char*)’中:
npm ERR! ../src/libsass/src/json.cpp:424:15: 警告:catching polymorphic type ‘class std::exception’ by value [-Wcatch-value=]
npm ERR!   424 |   catch (std::exception) {
npm ERR!       |               ^~~~~~~~~
npm ERR! In file included from ../src/libsass/src/listize.hpp:7,
npm ERR!                  from ../src/libsass/src/listize.cpp:6:
npm ERR! ../src/libsass/src/ast.hpp: 在成员函数‘virtual size_t Sass::Number::hash()’中:
npm ERR! ../src/libsass/src/ast.hpp:1614:25: 警告:loop variable ‘numerator’ creates a copy from type ‘const std::__cxx11::basic_string<char>’ [-Wrange-loop-construct]
npm ERR!  1614 |         for (const auto numerator : numerators)
npm ERR!       |                         ^~~~~~~~~
npm ERR! ../src/libsass/src/ast.hpp:1614:25: 附注:use reference type to prevent copying
npm ERR!  1614 |         for (const auto numerator : numerators)
npm ERR!       |                         ^~~~~~~~~
npm ERR!       |                         &
npm ERR! ../src/libsass/src/ast.hpp:1616:25: 警告:loop variable ‘denominator’ creates a copy from type ‘const std::__cxx11::basic_string<char>’ [-Wrange-loop-construct]
npm ERR!  1616 |         for (const auto denominator : denominators)
npm ERR!       |                         ^~~~~~~~~~~
npm ERR! ../src/libsass/src/ast.hpp:1616:25: 附注:use reference type to prevent copying
npm ERR!  1616 |         for (const auto denominator : denominators)
npm ERR!       |                         ^~~~~~~~~~~
npm ERR!       |                         &
npm ERR! In file included from ../src/libsass/src/node.hpp:7,
npm ERR!                  from ../src/libsass/src/node.cpp:4:
npm ERR! ../src/libsass/src/ast.hpp: 在成员函数‘virtual size_t Sass::Number::hash()’中:
npm ERR! ../src/libsass/src/ast.hpp:1614:25: 警告:loop variable ‘numerator’ creates a copy from type ‘const std::__cxx11::basic_string<char>’ [-Wrange-loop-construct]
npm ERR!  1614 |         for (const auto numerator : numerators)
npm ERR!       |                         ^~~~~~~~~
npm ERR! ../src/libsass/src/ast.hpp:1614:25: 附注:use reference type to prevent copying
npm ERR!  1614 |         for (const auto numerator : numerators)
npm ERR!       |                         ^~~~~~~~~
npm ERR!       |                         &
npm ERR! ../src/libsass/src/ast.hpp:1616:25: 警告:loop variable ‘denominator’ creates a copy from type ‘const std::__cxx11::basic_string<char>’ [-Wrange-loop-construct]
npm ERR!  1616 |         for (const auto denominator : denominators)
npm ERR!       |                         ^~~~~~~~~~~
npm ERR! ../src/libsass/src/ast.hpp:1616:25: 附注:use reference type to prevent copying
npm ERR!  1616 |         for (const auto denominator : denominators)
npm ERR!       |                         ^~~~~~~~~~~
npm ERR!       |                         &
npm ERR! In file included from ../src/libsass/src/values.hpp:4,
npm ERR!                  from ../src/libsass/src/operators.hpp:4,
npm ERR!                  from ../src/libsass/src/operators.cpp:2:
npm ERR! ../src/libsass/src/ast.hpp: 在成员函数‘virtual size_t Sass::Number::hash()’中:
npm ERR! ../src/libsass/src/ast.hpp:1614:25: 警告:loop variable ‘numerator’ creates a copy from type ‘const std::__cxx11::basic_string<char>’ [-Wrange-loop-construct]
npm ERR!  1614 |         for (const auto numerator : numerators)
npm ERR!       |                         ^~~~~~~~~
npm ERR! ../src/libsass/src/ast.hpp:1614:25: 附注:use reference type to prevent copying
npm ERR!  1614 |         for (const auto numerator : numerators)
npm ERR!       |                         ^~~~~~~~~
npm ERR!       |                         &
npm ERR! ../src/libsass/src/ast.hpp:1616:25: 警告:loop variable ‘denominator’ creates a copy from type ‘const std::__cxx11::basic_string<char>’ [-Wrange-loop-construct]
npm ERR!  1616 |         for (const auto denominator : denominators)
npm ERR!       |                         ^~~~~~~~~~~
npm ERR! ../src/libsass/src/ast.hpp:1616:25: 附注:use reference type to prevent copying
npm ERR!  1616 |         for (const auto denominator : denominators)
npm ERR!       |                         ^~~~~~~~~~~
npm ERR!       |                         &
npm ERR! In file included from ../src/libsass/src/output.cpp:2:
npm ERR! ../src/libsass/src/ast.hpp: 在成员函数‘virtual size_t Sass::Number::hash()’中:
npm ERR! ../src/libsass/src/ast.hpp:1614:25: 警告:loop variable ‘numerator’ creates a copy from type ‘const std::__cxx11::basic_string<char>’ [-Wrange-loop-construct]
npm ERR!  1614 |         for (const auto numerator : numerators)
npm ERR!       |                         ^~~~~~~~~
npm ERR! ../src/libsass/src/ast.hpp:1614:25: 附注:use reference type to prevent copying
npm ERR!  1614 |         for (const auto numerator : numerators)
npm ERR!       |                         ^~~~~~~~~
npm ERR!       |                         &
npm ERR! ../src/libsass/src/ast.hpp:1616:25: 警告:loop variable ‘denominator’ creates a copy from type ‘const std::__cxx11::basic_string<char>’ [-Wrange-loop-construct]
npm ERR!  1616 |         for (const auto denominator : denominators)
npm ERR!       |                         ^~~~~~~~~~~
npm ERR! ../src/libsass/src/ast.hpp:1616:25: 附注:use reference type to prevent copying
npm ERR!  1616 |         for (const auto denominator : denominators)
npm ERR!       |                         ^~~~~~~~~~~
npm ERR!       |                         &
npm ERR! In file included from ../src/libsass/src/parser.hpp:7,
npm ERR!                  from ../src/libsass/src/parser.cpp:2:
npm ERR! ../src/libsass/src/ast.hpp: 在成员函数‘virtual size_t Sass::Number::hash()’中:
npm ERR! ../src/libsass/src/ast.hpp:1614:25: 警告:loop variable ‘numerator’ creates a copy from type ‘const std::__cxx11::basic_string<char>’ [-Wrange-loop-construct]
npm ERR!  1614 |         for (const auto numerator : numerators)
npm ERR!       |                         ^~~~~~~~~
npm ERR! ../src/libsass/src/ast.hpp:1614:25: 附注:use reference type to prevent copying
npm ERR!  1614 |         for (const auto numerator : numerators)
npm ERR!       |                         ^~~~~~~~~
npm ERR!       |                         &
npm ERR! ../src/libsass/src/ast.hpp:1616:25: 警告:loop variable ‘denominator’ creates a copy from type ‘const std::__cxx11::basic_string<char>’ [-Wrange-loop-construct]
npm ERR!  1616 |         for (const auto denominator : denominators)
npm ERR!       |                         ^~~~~~~~~~~
npm ERR! ../src/libsass/src/ast.hpp:1616:25: 附注:use reference type to prevent copying
npm ERR!  1616 |         for (const auto denominator : denominators)
npm ERR!       |                         ^~~~~~~~~~~
npm ERR!       |                         &
npm ERR! In file included from ../src/libsass/src/remove_placeholders.hpp:6,
npm ERR!                  from ../src/libsass/src/remove_placeholders.cpp:2:
npm ERR! ../src/libsass/src/ast.hpp: 在成员函数‘virtual size_t Sass::Number::hash()’中:
npm ERR! ../src/libsass/src/ast.hpp:1614:25: 警告:loop variable ‘numerator’ creates a copy from type ‘const std::__cxx11::basic_string<char>’ [-Wrange-loop-construct]
npm ERR!  1614 |         for (const auto numerator : numerators)
npm ERR!       |                         ^~~~~~~~~
npm ERR! ../src/libsass/src/ast.hpp:1614:25: 附注:use reference type to prevent copying
npm ERR!  1614 |         for (const auto numerator : numerators)
npm ERR!       |                         ^~~~~~~~~
npm ERR!       |                         &
npm ERR! ../src/libsass/src/ast.hpp:1616:25: 警告:loop variable ‘denominator’ creates a copy from type ‘const std::__cxx11::basic_string<char>’ [-Wrange-loop-construct]
npm ERR!  1616 |         for (const auto denominator : denominators)
npm ERR!       |                         ^~~~~~~~~~~
npm ERR! ../src/libsass/src/ast.hpp:1616:25: 附注:use reference type to prevent copying
npm ERR!  1616 |         for (const auto denominator : denominators)
npm ERR!       |                         ^~~~~~~~~~~
npm ERR!       |                         &
npm ERR! In file included from ../src/libsass/src/listize.hpp:7,
npm ERR!                  from ../src/libsass/src/functions.hpp:4,
npm ERR!                  from ../src/libsass/src/sass_functions.hpp:6,
npm ERR!                  from ../src/libsass/src/sass.cpp:11:
npm ERR! ../src/libsass/src/ast.hpp: 在成员函数‘virtual size_t Sass::Number::hash()’中:
npm ERR! ../src/libsass/src/ast.hpp:1614:25: 警告:loop variable ‘numerator’ creates a copy from type ‘const std::__cxx11::basic_string<char>’ [-Wrange-loop-construct]
npm ERR!  1614 |         for (const auto numerator : numerators)
npm ERR!       |                         ^~~~~~~~~
npm ERR! ../src/libsass/src/ast.hpp:1614:25: 附注:use reference type to prevent copying
npm ERR!  1614 |         for (const auto numerator : numerators)
npm ERR!       |                         ^~~~~~~~~
npm ERR!       |                         &
npm ERR! ../src/libsass/src/ast.hpp:1616:25: 警告:loop variable ‘denominator’ creates a copy from type ‘const std::__cxx11::basic_string<char>’ [-Wrange-loop-construct]
npm ERR!  1616 |         for (const auto denominator : denominators)
npm ERR!       |                         ^~~~~~~~~~~
npm ERR! ../src/libsass/src/ast.hpp:1616:25: 附注:use reference type to prevent copying
npm ERR!  1616 |         for (const auto denominator : denominators)
npm ERR!       |                         ^~~~~~~~~~~
npm ERR!       |                         &
npm ERR! In file included from ../src/libsass/src/sass_context.cpp:9:
npm ERR! ../src/libsass/src/ast.hpp: 在成员函数‘virtual size_t Sass::Number::hash()’中:
npm ERR! ../src/libsass/src/ast.hpp:1614:25: 警告:loop variable ‘numerator’ creates a copy from type ‘const std::__cxx11::basic_string<char>’ [-Wrange-loop-construct]
npm ERR!  1614 |         for (const auto numerator : numerators)
npm ERR!       |                         ^~~~~~~~~
npm ERR! ../src/libsass/src/ast.hpp:1614:25: 附注:use reference type to prevent copying
npm ERR!  1614 |         for (const auto numerator : numerators)
npm ERR!       |                         ^~~~~~~~~
npm ERR!       |                         &
npm ERR! ../src/libsass/src/ast.hpp:1616:25: 警告:loop variable ‘denominator’ creates a copy from type ‘const std::__cxx11::basic_string<char>’ [-Wrange-loop-construct]
npm ERR!  1616 |         for (const auto denominator : denominators)
npm ERR!       |                         ^~~~~~~~~~~
npm ERR! ../src/libsass/src/ast.hpp:1616:25: 附注:use reference type to prevent copying
npm ERR!  1616 |         for (const auto denominator : denominators)
npm ERR!       |                         ^~~~~~~~~~~
npm ERR!       |                         &
npm ERR! In file included from ../src/libsass/src/values.hpp:4,
npm ERR!                  from ../src/libsass/src/sass_functions.cpp:5:
npm ERR! ../src/libsass/src/ast.hpp: 在成员函数‘virtual size_t Sass::Number::hash()’中:
npm ERR! ../src/libsass/src/ast.hpp:1614:25: 警告:loop variable ‘numerator’ creates a copy from type ‘const std::__cxx11::basic_string<char>’ [-Wrange-loop-construct]
npm ERR!  1614 |         for (const auto numerator : numerators)
npm ERR!       |                         ^~~~~~~~~
npm ERR! ../src/libsass/src/ast.hpp:1614:25: 附注:use reference type to prevent copying
npm ERR!  1614 |         for (const auto numerator : numerators)
npm ERR!       |                         ^~~~~~~~~
npm ERR!       |                         &
npm ERR! ../src/libsass/src/ast.hpp:1616:25: 警告:loop variable ‘denominator’ creates a copy from type ‘const std::__cxx11::basic_string<char>’ [-Wrange-loop-construct]
npm ERR!  1616 |         for (const auto denominator : denominators)
npm ERR!       |                         ^~~~~~~~~~~
npm ERR! ../src/libsass/src/ast.hpp:1616:25: 附注:use reference type to prevent copying
npm ERR!  1616 |         for (const auto denominator : denominators)
npm ERR!       |                         ^~~~~~~~~~~
npm ERR!       |                         &
npm ERR! In file included from ../src/libsass/src/node.hpp:7,
npm ERR!                  from ../src/libsass/src/sass_util.cpp:2:
npm ERR! ../src/libsass/src/ast.hpp: 在成员函数‘virtual size_t Sass::Number::hash()’中:
npm ERR! ../src/libsass/src/ast.hpp:1614:25: 警告:loop variable ‘numerator’ creates a copy from type ‘const std::__cxx11::basic_string<char>’ [-Wrange-loop-construct]
npm ERR!  1614 |         for (const auto numerator : numerators)
npm ERR!       |                         ^~~~~~~~~
npm ERR! ../src/libsass/src/ast.hpp:1614:25: 附注:use reference type to prevent copying
npm ERR!  1614 |         for (const auto numerator : numerators)
npm ERR!       |                         ^~~~~~~~~
npm ERR!       |                         &
npm ERR! ../src/libsass/src/ast.hpp:1616:25: 警告:loop variable ‘denominator’ creates a copy from type ‘const std::__cxx11::basic_string<char>’ [-Wrange-loop-construct]
npm ERR!  1616 |         for (const auto denominator : denominators)
npm ERR!       |                         ^~~~~~~~~~~
npm ERR! ../src/libsass/src/ast.hpp:1616:25: 附注:use reference type to prevent copying
npm ERR!  1616 |         for (const auto denominator : denominators)
npm ERR!       |                         ^~~~~~~~~~~
npm ERR!       |                         &
npm ERR! In file included from ../src/libsass/src/eval.hpp:4,
npm ERR!                  from ../src/libsass/src/sass_values.cpp:5:
npm ERR! ../src/libsass/src/ast.hpp: 在成员函数‘virtual size_t Sass::Number::hash()’中:
npm ERR! ../src/libsass/src/ast.hpp:1614:25: 警告:loop variable ‘numerator’ creates a copy from type ‘const std::__cxx11::basic_string<char>’ [-Wrange-loop-construct]
npm ERR!  1614 |         for (const auto numerator : numerators)
npm ERR!       |                         ^~~~~~~~~
npm ERR! ../src/libsass/src/ast.hpp:1614:25: 附注:use reference type to prevent copying
npm ERR!  1614 |         for (const auto numerator : numerators)
npm ERR!       |                         ^~~~~~~~~
npm ERR!       |                         &
npm ERR! ../src/libsass/src/ast.hpp:1616:25: 警告:loop variable ‘denominator’ creates a copy from type ‘const std::__cxx11::basic_string<char>’ [-Wrange-loop-construct]
npm ERR!  1616 |         for (const auto denominator : denominators)
npm ERR!       |                         ^~~~~~~~~~~
npm ERR! ../src/libsass/src/ast.hpp:1616:25: 附注:use reference type to prevent copying
npm ERR!  1616 |         for (const auto denominator : denominators)
npm ERR!       |                         ^~~~~~~~~~~
npm ERR!       |                         &
npm ERR! In file included from ../src/libsass/src/source_map.cpp:7:
npm ERR! ../src/libsass/src/ast.hpp: 在成员函数‘virtual size_t Sass::Number::hash()’中:
npm ERR! ../src/libsass/src/ast.hpp:1614:25: 警告:loop variable ‘numerator’ creates a copy from type ‘const std::__cxx11::basic_string<char>’ [-Wrange-loop-construct]
npm ERR!  1614 |         for (const auto numerator : numerators)
npm ERR!       |                         ^~~~~~~~~
npm ERR! ../src/libsass/src/ast.hpp:1614:25: 附注:use reference type to prevent copying
npm ERR!  1614 |         for (const auto numerator : numerators)
npm ERR!       |                         ^~~~~~~~~
npm ERR!       |                         &
npm ERR! ../src/libsass/src/ast.hpp:1616:25: 警告:loop variable ‘denominator’ creates a copy from type ‘const std::__cxx11::basic_string<char>’ [-Wrange-loop-construct]
npm ERR!  1616 |         for (const auto denominator : denominators)
npm ERR!       |                         ^~~~~~~~~~~
npm ERR! ../src/libsass/src/ast.hpp:1616:25: 附注:use reference type to prevent copying
npm ERR!  1616 |         for (const auto denominator : denominators)
npm ERR!       |                         ^~~~~~~~~~~
npm ERR!       |                         &
npm ERR! In file included from ../src/libsass/src/subset_map.cpp:2:
npm ERR! ../src/libsass/src/ast.hpp: 在成员函数‘virtual size_t Sass::Number::hash()’中:
npm ERR! ../src/libsass/src/ast.hpp:1614:25: 警告:loop variable ‘numerator’ creates a copy from type ‘const std::__cxx11::basic_string<char>’ [-Wrange-loop-construct]
npm ERR!  1614 |         for (const auto numerator : numerators)
npm ERR!       |                         ^~~~~~~~~
npm ERR! ../src/libsass/src/ast.hpp:1614:25: 附注:use reference type to prevent copying
npm ERR!  1614 |         for (const auto numerator : numerators)
npm ERR!       |                         ^~~~~~~~~
npm ERR!       |                         &
npm ERR! ../src/libsass/src/ast.hpp:1616:25: 警告:loop variable ‘denominator’ creates a copy from type ‘const std::__cxx11::basic_string<char>’ [-Wrange-loop-construct]
npm ERR!  1616 |         for (const auto denominator : denominators)
npm ERR!       |                         ^~~~~~~~~~~
npm ERR! ../src/libsass/src/ast.hpp:1616:25: 附注:use reference type to prevent copying
npm ERR!  1616 |         for (const auto denominator : denominators)
npm ERR!       |                         ^~~~~~~~~~~
npm ERR!       |                         &
npm ERR! In file included from ../src/libsass/src/to_c.cpp:3:
npm ERR! ../src/libsass/src/ast.hpp: 在成员函数‘virtual size_t Sass::Number::hash()’中:
npm ERR! ../src/libsass/src/ast.hpp:1614:25: 警告:loop variable ‘numerator’ creates a copy from type ‘const std::__cxx11::basic_string<char>’ [-Wrange-loop-construct]
npm ERR!  1614 |         for (const auto numerator : numerators)
npm ERR!       |                         ^~~~~~~~~
npm ERR! ../src/libsass/src/ast.hpp:1614:25: 附注:use reference type to prevent copying
npm ERR!  1614 |         for (const auto numerator : numerators)
npm ERR!       |                         ^~~~~~~~~
npm ERR!       |                         &
npm ERR! ../src/libsass/src/ast.hpp:1616:25: 警告:loop variable ‘denominator’ creates a copy from type ‘const std::__cxx11::basic_string<char>’ [-Wrange-loop-construct]
npm ERR!  1616 |         for (const auto denominator : denominators)
npm ERR!       |                         ^~~~~~~~~~~
npm ERR! ../src/libsass/src/ast.hpp:1616:25: 附注:use reference type to prevent copying
npm ERR!  1616 |         for (const auto denominator : denominators)
npm ERR!       |                         ^~~~~~~~~~~
npm ERR!       |                         &
npm ERR! In file included from ../src/libsass/src/to_value.cpp:2:
npm ERR! ../src/libsass/src/ast.hpp: 在成员函数‘virtual size_t Sass::Number::hash()’中:
npm ERR! ../src/libsass/src/ast.hpp:1614:25: 警告:loop variable ‘numerator’ creates a copy from type ‘const std::__cxx11::basic_string<char>’ [-Wrange-loop-construct]
npm ERR!  1614 |         for (const auto numerator : numerators)
npm ERR!       |                         ^~~~~~~~~
npm ERR! ../src/libsass/src/ast.hpp:1614:25: 附注:use reference type to prevent copying
npm ERR!  1614 |         for (const auto numerator : numerators)
npm ERR!       |                         ^~~~~~~~~
npm ERR!       |                         &
npm ERR! ../src/libsass/src/ast.hpp:1616:25: 警告:loop variable ‘denominator’ creates a copy from type ‘const std::__cxx11::basic_string<char>’ [-Wrange-loop-construct]
npm ERR!  1616 |         for (const auto denominator : denominators)
npm ERR!       |                         ^~~~~~~~~~~
npm ERR! ../src/libsass/src/ast.hpp:1616:25: 附注:use reference type to prevent copying
npm ERR!  1616 |         for (const auto denominator : denominators)
npm ERR!       |                         ^~~~~~~~~~~
npm ERR!       |                         &
npm ERR! In file included from ../src/libsass/src/util.cpp:3:
npm ERR! ../src/libsass/src/ast.hpp: 在成员函数‘virtual size_t Sass::Number::hash()’中:
npm ERR! ../src/libsass/src/ast.hpp:1614:25: 警告:loop variable ‘numerator’ creates a copy from type ‘const std::__cxx11::basic_string<char>’ [-Wrange-loop-construct]
npm ERR!  1614 |         for (const auto numerator : numerators)
npm ERR!       |                         ^~~~~~~~~
npm ERR! ../src/libsass/src/ast.hpp:1614:25: 附注:use reference type to prevent copying
npm ERR!  1614 |         for (const auto numerator : numerators)
npm ERR!       |                         ^~~~~~~~~
npm ERR!       |                         &
npm ERR! ../src/libsass/src/ast.hpp:1616:25: 警告:loop variable ‘denominator’ creates a copy from type ‘const std::__cxx11::basic_string<char>’ [-Wrange-loop-construct]
npm ERR!  1616 |         for (const auto denominator : denominators)
npm ERR!       |                         ^~~~~~~~~~~
npm ERR! ../src/libsass/src/ast.hpp:1616:25: 附注:use reference type to prevent copying
npm ERR!  1616 |         for (const auto denominator : denominators)
npm ERR!       |                         ^~~~~~~~~~~
npm ERR!       |                         &
npm ERR! In file included from ../src/libsass/src/values.hpp:4,
npm ERR!                  from ../src/libsass/src/values.cpp:3:
npm ERR! ../src/libsass/src/ast.hpp: 在成员函数‘virtual size_t Sass::Number::hash()’中:
npm ERR! ../src/libsass/src/ast.hpp:1614:25: 警告:loop variable ‘numerator’ creates a copy from type ‘const std::__cxx11::basic_string<char>’ [-Wrange-loop-construct]
npm ERR!  1614 |         for (const auto numerator : numerators)
npm ERR!       |                         ^~~~~~~~~
npm ERR! ../src/libsass/src/ast.hpp:1614:25: 附注:use reference type to prevent copying
npm ERR!  1614 |         for (const auto numerator : numerators)
npm ERR!       |                         ^~~~~~~~~
npm ERR!       |                         &
npm ERR! ../src/libsass/src/ast.hpp:1616:25: 警告:loop variable ‘denominator’ creates a copy from type ‘const std::__cxx11::basic_string<char>’ [-Wrange-loop-construct]
npm ERR!  1616 |         for (const auto denominator : denominators)
npm ERR!       |                         ^~~~~~~~~~~
npm ERR! ../src/libsass/src/ast.hpp:1616:25: 附注:use reference type to prevent copying
npm ERR!  1616 |         for (const auto denominator : denominators)
npm ERR!       |                         ^~~~~~~~~~~
npm ERR!       |                         &
npm ERR! In file included from /home/cm/.node-gyp/16.11.1/include/node/v8.h:30,
npm ERR!                  from /home/cm/.node-gyp/16.11.1/include/node/node.h:63,
npm ERR!                  from ../../nan/nan.h:56,
npm ERR!                  from ../src/binding.cpp:1:
npm ERR! /home/cm/.node-gyp/16.11.1/include/node/v8-internal.h: 在函数‘void v8::internal::PerformCastCheck(T*)’中:
npm ERR! /home/cm/.node-gyp/16.11.1/include/node/v8-internal.h:492:38: 错误:‘remove_cv_t’ is not a member of ‘std’; did you mean ‘remove_cv’?
npm ERR!   492 |             !std::is_same<Data, std::remove_cv_t<T>>::value>::Perform(data);
npm ERR!       |                                      ^~~~~~~~~~~
npm ERR!       |                                      remove_cv
npm ERR! /home/cm/.node-gyp/16.11.1/include/node/v8-internal.h:492:38: 错误:‘remove_cv_t’ is not a member of ‘std’; did you mean ‘remove_cv’?
npm ERR!   492 |             !std::is_same<Data, std::remove_cv_t<T>>::value>::Perform(data);
npm ERR!       |                                      ^~~~~~~~~~~
npm ERR!       |                                      remove_cv
npm ERR! /home/cm/.node-gyp/16.11.1/include/node/v8-internal.h:492:50: 错误:模板第 2 个参数无效
npm ERR!   492 |             !std::is_same<Data, std::remove_cv_t<T>>::value>::Perform(data);
npm ERR!       |                                                  ^
npm ERR! /home/cm/.node-gyp/16.11.1/include/node/v8-internal.h:492:63: 错误:‘::Perform’未被声明
npm ERR!   492 |             !std::is_same<Data, std::remove_cv_t<T>>::value>::Perform(data);
npm ERR!       |                                                               ^~~~~~~
npm ERR! ../src/binding.cpp: 在函数‘Nan::NAN_METHOD_RETURN_TYPE render(Nan::NAN_METHOD_ARGS_TYPE)’中:
npm ERR! ../src/binding.cpp:284:80: 警告:cast between incompatible function types from ‘void (*)(uv_work_t*)’ {aka ‘void (*)(uv_work_s*)’} to ‘uv_after_work_cb’ {aka ‘void (*)(uv_work_s*, int)’} [-Wcast-function-type]
npm ERR!   284 |     int status = uv_queue_work(uv_default_loop(), &ctx_w->request, compile_it, (uv_after_work_cb)MakeCallback);
npm ERR!       |                                                                                ^~~~~~~~~~~~~~~~~~~~~~~~~~~~~~
npm ERR! ../src/binding.cpp: 在函数‘Nan::NAN_METHOD_RETURN_TYPE render_file(Nan::NAN_METHOD_ARGS_TYPE)’中:
npm ERR! ../src/binding.cpp:320:80: 警告:cast between incompatible function types from ‘void (*)(uv_work_t*)’ {aka ‘void (*)(uv_work_s*)’} to ‘uv_after_work_cb’ {aka ‘void (*)(uv_work_s*, int)’} [-Wcast-function-type]
npm ERR!   320 |     int status = uv_queue_work(uv_default_loop(), &ctx_w->request, compile_it, (uv_after_work_cb)MakeCallback);
npm ERR!       |                                                                                ^~~~~~~~~~~~~~~~~~~~~~~~~~~~~~
npm ERR! In file included from ../../nan/nan.h:56,
npm ERR!                  from ../src/binding.cpp:1:
npm ERR! ../src/binding.cpp: 在全局域:
npm ERR! /home/cm/.node-gyp/16.11.1/include/node/node.h:821:7: 警告:cast between incompatible function types from ‘void (*)(Nan::ADDON_REGISTER_FUNCTION_ARGS_TYPE)’ {aka ‘void (*)(v8::Local<v8::Object>)’} to ‘node::addon_register_func’ {aka ‘void (*)(v8::Local<v8::Object>, v8::Local<v8::Value>, void*)’} [-Wcast-function-type]
npm ERR!   821 |       (node::addon_register_func) (regfunc),                          \
npm ERR!       |       ^~~~~~~~~~~~~~~~~~~~~~~~~~~~~~~~~~~~~
npm ERR! /home/cm/.node-gyp/16.11.1/include/node/node.h:855:3: 附注:in expansion of macro ‘NODE_MODULE_X’
npm ERR!   855 |   NODE_MODULE_X(modname, regfunc, NULL, 0)  // NOLINT (readability/null_usage)
npm ERR!       |   ^~~~~~~~~~~~~
npm ERR! ../src/binding.cpp:358:1: 附注:in expansion of macro ‘NODE_MODULE’
npm ERR!   358 | NODE_MODULE(binding, RegisterModule);
npm ERR!       | ^~~~~~~~~~~
npm ERR! make: *** [binding.target.mk:129:Release/obj.target/binding/src/binding.o] 错误 1
npm ERR! gyp ERR! build error 
npm ERR! gyp ERR! stack Error: `make` failed with exit code: 2
npm ERR! gyp ERR! stack     at ChildProcess.onExit (/it/www/vue/node_modules/node-gyp/lib/build.js:262:23)
npm ERR! gyp ERR! stack     at ChildProcess.emit (node:events:390:28)
npm ERR! gyp ERR! stack     at Process.ChildProcess._handle.onexit (node:internal/child_process:290:12)
npm ERR! gyp ERR! System Linux 5.14.12-arch1-1
npm ERR! gyp ERR! command "/usr/bin/node" "/it/www/vue/node_modules/.bin/node-gyp" "rebuild"
npm ERR! gyp ERR! cwd /it/www/vue/node_modules/node-sass
npm ERR! gyp ERR! node -v v16.11.1
npm ERR! gyp ERR! node-gyp -v v3.8.0
npm ERR! gyp ERR! not ok
npm verb exit 1
npm timing npm Completed in 81582ms
npm verb unfinished npm timer reify 1635591837792
npm verb unfinished npm timer reify:build 1635591843822
npm verb unfinished npm timer build 1635591843825
npm verb unfinished npm timer build:deps 1635591843826
npm verb unfinished npm timer build:run:install 1635591843861
npm verb unfinished npm timer build:run:install:node_modules/node-sass 1635591843861
npm verb code 1

npm ERR! A complete log of this run can be found in:

离线

#4 2021-11-29 11:14:17

icepie
会员
注册时间: 2021-09-08
帖子: 3
个人网站

Re: npm安装node-sass报错

编译uni-app项目的时候遇到过 推荐用nvm切换到 node 14 的lts版本... 就可以编译通过了

离线

页脚